{"text_format":"1","workbook":"xlsx","n_sheets":27,"sheets":["PrøverVandret","PrøverLodret","PrøverHP14","Definitioner","1","4","BYG2","BYG5","BYG4","BYG1","Udgået_miljø","Udgået_århus","5","6","7","8","9","10","3","11","Udgået_5","2","CFRS","BYGHP14","BYG3","Vejledning","Log"],"not_rendered":{"charts":0,"images":10,"macros":1,"external_links":0,"defined_names":45,"comments":2,"pivot_tables":0},"unopened":[],"bounds":{"document_bytes":16777216,"sheet_cells":100000,"rows_first":2000,"rows_last":500,"rows_between":2000,"halvings":0,"cell_chars":16384,"cell_head_chars":4096},"cells_cut":0,"cells_raw":0,"read":"whole","date_system":"1900"}

{"sheet":"PrøverVandret","index":0,"n_rows":116,"n_cols":10,"rows_kept":116,"cut":false,"hidden":false,"merged":[[0,2,0,7]]}
[0,null,"Eurofins fralægger sig ethvert ansvar for anden parts brug af resultater og klassificering fremkommet ved anvendelsen af denne software.",null,null,null,null,null,"Jordklasse  ►","Kategori 1"]
["AR-24-VL-01036661-01",null,null,"Kallerup Grusgrav , -, Muldjord",null,null,null,null,"Prøve-nummer ►","862-2024-03666101"]
["ELIMS",2,3,{"$f":"IF(ISERROR(LimitTypeLookup(Regelsæt,1)),\"\",LimitTypeLookup(Regelsæt,1))","v":"<="},{"$f":"IF(ISERROR(LimitTypeLookup(Regelsæt,2)),\"\",LimitTypeLookup(Regelsæt,2))","v":"<="},{"$f":"IF(ISERROR(LimitTypeLookup(Regelsæt,3)),\"\",LimitTypeLookup(Regelsæt,3))","v":">"},{"$f":"IF(ISERROR(LimitTypeLookup(Regelsæt,4)),\"\",LimitTypeLookup(Regelsæt,4))","v":""},{"$f":"IF(ISERROR(LimitTypeLookup(Regelsæt,5)),\"\",LimitTypeLookup(Regelsæt,5))","v":""},"Prøve-mærkning ►","-"]
["Production","Parameter▼","Enhed",{"$f":"IF(ISERROR(HeaderLookUp(Regelsæt,1)),\"\",HeaderLookUp(Regelsæt,1))","v":"Kategori 1"},{"$f":"IF(ISERROR(HeaderLookUp(Regelsæt,2)),\"\",HeaderLookUp(Regelsæt,2))","v":"Kategori 2"},{"$f":"IF(ISERROR(HeaderLookUp(Regelsæt,3)),\"\",HeaderLookUp(Regelsæt,3))","v":"Udenfor Kat."},{"$f":"IF(ISERROR(HeaderLookUp(Regelsæt,4)),\"\",HeaderLookUp(Regelsæt,4))","v":""},{"$f":"IF(ISERROR(HeaderLookUp(Regelsæt,5)),\"\",HeaderLookUp(Regelsæt,5))","v":""}]
[{"$f":"IF(I5=\"\",\"\",IF($A$3=\"ELIMS\",IF(ISNA(VLOOKUP(I5,Definitioner!$P$2:$S$381,2,FALSE)),\"\",VLOOKUP(I5,Definitioner!$P$2:$S$381,2,FALSE)),VLOOKUP(I5,Definitioner!$O$2:$S$381,3,FALSE)))","v":""},"Tørstof","%",{"$f":"IF(LEN(A5),LimitLookup($A5,Regelsæt,1),\"\")","v":""},{"$f":"IF(LEN(A5),LimitLookup($A5,Regelsæt,2),\"\")","v":""},{"$f":"IF(LEN(A5),LimitLookup($A5,Regelsæt,3),\"\")","v":""},{"$f":"IF(LEN(A5),LimitLookup($A5,Regelsæt,4),\"\")","v":""},{"$f":"IF(LEN(A5),LimitLookup($A5,Regelsæt,5),\"\")","v":""},"VL142|F001F129","82"]
[{"$f":"IF(I6=\"\",\"\",IF($A$3=\"ELIMS\",IF(ISNA(VLOOKUP(I6,Definitioner!$P$2:$S$381,2,FALSE)),\"\",VLOOKUP(I6,Definitioner!$P$2:$S$381,2,FALSE)),VLOOKUP(I6,Definitioner!$O$2:$S$381,3,FALSE)))","v":2},"Bly (Pb)","mg/kg ts.",{"$f":"IF(LEN(A6),LimitLookup($A6,Regelsæt,1),\"\")","v":"40"},{"$f":"IF(LEN(A6),LimitLookup($A6,Regelsæt,2),\"\")","v":"400"},{"$f":"IF(LEN(A6),LimitLookup($A6,Regelsæt,3),\"\")","v":"400"},{"$f":"IF(LEN(A6),LimitLookup($A6,Regelsæt,4),\"\")","v":""},{"$f":"IF(LEN(A6),LimitLookup($A6,Regelsæt,5),\"\")","v":""},"VLBD5|7003A003","11"]
[{"$f":"IF(I7=\"\",\"\",IF($A$3=\"ELIMS\",IF(ISNA(VLOOKUP(I7,Definitioner!$P$2:$S$381,2,FALSE)),\"\",VLOOKUP(I7,Definitioner!$P$2:$S$381,2,FALSE)),VLOOKUP(I7,Definitioner!$O$2:$S$381,3,FALSE)))","v":3},"Cadmium (Cd)","mg/kg ts.",{"$f":"IF(LEN(A7),LimitLookup($A7,Regelsæt,1),\"\")","v":"0,5"},{"$f":"IF(LEN(A7),LimitLookup($A7,Regelsæt,2),\"\")","v":"5"},{"$f":"IF(LEN(A7),LimitLookup($A7,Regelsæt,3),\"\")","v":"5"},{"$f":"IF(LEN(A7),LimitLookup($A7,Regelsæt,4),\"\")","v":""},{"$f":"IF(LEN(A7),LimitLookup($A7,Regelsæt,5),\"\")","v":""},"VLBC5|7003A016","0,14"]
[{"$f":"IF(I8=\"\",\"\",IF($A$3=\"ELIMS\",IF(ISNA(VLOOKUP(I8,Definitioner!$P$2:$S$381,2,FALSE)),\"\",VLOOKUP(I8,Definitioner!$P$2:$S$381,2,FALSE)),VLOOKUP(I8,Definitioner!$O$2:$S$381,3,FALSE)))","v":5},"Chrom (Cr)","mg/kg ts.",{"$f":"IF(LEN(A8),LimitLookup($A8,Regelsæt,1),\"\")","v":"500"},{"$f":"IF(LEN(A8),LimitLookup($A8,Regelsæt,2),\"\")","v":"1000"},{"$f":"IF(LEN(A8),LimitLookup($A8,Regelsæt,3),\"\")","v":"1000"},{"$f":"IF(LEN(A8),LimitLookup($A8,Regelsæt,4),\"\")","v":""},{"$f":"IF(LEN(A8),LimitLookup($A8,Regelsæt,5),\"\")","v":""},"VLBD0|7003A005","11"]
[{"$f":"IF(I9=\"\",\"\",IF($A$3=\"ELIMS\",IF(ISNA(VLOOKUP(I9,Definitioner!$P$2:$S$381,2,FALSE)),\"\",VLOOKUP(I9,Definitioner!$P$2:$S$381,2,FALSE)),VLOOKUP(I9,Definitioner!$O$2:$S$381,3,FALSE)))","v":6},"Kobber (Cu)","mg/kg ts.",{"$f":"IF(LEN(A9),LimitLookup($A9,Regelsæt,1),\"\")","v":"500"},{"$f":"IF(LEN(A9),LimitLookup($A9,Regelsæt,2),\"\")","v":"1000"},{"$f":"IF(LEN(A9),LimitLookup($A9,Regelsæt,3),\"\")","v":"1000"},{"$f":"IF(LEN(A9),LimitLookup($A9,Regelsæt,4),\"\")","v":""},{"$f":"IF(LEN(A9),LimitLookup($A9,Regelsæt,5),\"\")","v":""},"VLBA2|7001A010","7,4"]
[{"$f":"IF(I10=\"\",\"\",IF($A$3=\"ELIMS\",IF(ISNA(VLOOKUP(I10,Definitioner!$P$2:$S$381,2,FALSE)),\"\",VLOOKUP(I10,Definitioner!$P$2:$S$381,2,FALSE)),VLOOKUP(I10,Definitioner!$O$2:$S$381,3,FALSE)))","v":8},"Nikkel (Ni)","mg/kg ts.",{"$f":"IF(LEN(A10),LimitLookup($A10,Regelsæt,1),\"\")","v":"30"},{"$f":"IF(LEN(A10),LimitLookup($A10,Regelsæt,2),\"\")","v":"30"},{"$f":"IF(LEN(A10),LimitLookup($A10,Regelsæt,3),\"\")","v":"30"},{"$f":"IF(LEN(A10),LimitLookup($A10,Regelsæt,4),\"\")","v":""},{"$f":"IF(LEN(A10),LimitLookup($A10,Regelsæt,5),\"\")","v":""},"VLBD7|7003A007","6,4"]
[{"$f":"IF(I11=\"\",\"\",IF($A$3=\"ELIMS\",IF(ISNA(VLOOKUP(I11,Definitioner!$P$2:$S$381,2,FALSE)),\"\",VLOOKUP(I11,Definitioner!$P$2:$S$381,2,FALSE)),VLOOKUP(I11,Definitioner!$O$2:$S$381,3,FALSE)))","v":10},"Zink (Zn)","mg/kg ts.",{"$f":"IF(LEN(A11),LimitLookup($A11,Regelsæt,1),\"\")","v":"500"},{"$f":"IF(LEN(A11),LimitLookup($A11,Regelsæt,2),\"\")","v":"1000"},{"$f":"IF(LEN(A11),LimitLookup($A11,Regelsæt,3),\"\")","v":"1000"},{"$f":"IF(LEN(A11),LimitLookup($A11,Regelsæt,4),\"\")","v":""},{"$f":"IF(LEN(A11),LimitLookup($A11,Regelsæt,5),\"\")","v":""},"VLB6T|7001A013","32"]
[{"$f":"IF(I12=\"\",\"\",IF($A$3=\"ELIMS\",IF(ISNA(VLOOKUP(I12,Definitioner!$P$2:$S$381,2,FALSE)),\"\",VLOOKUP(I12,Definitioner!$P$2:$S$381,2,FALSE)),VLOOKUP(I12,Definitioner!$O$2:$S$381,3,FALSE)))","v":12},"C6H6-C10","mg/kg ts.",{"$f":"IF(LEN(A12),LimitLookup($A12,Regelsæt,1),\"\")","v":"25"},{"$f":"IF(LEN(A12),LimitLookup($A12,Regelsæt,2),\"\")","v":"25"},{"$f":"IF(LEN(A12),LimitLookup($A12,Regelsæt,3),\"\")","v":"25"},{"$f":"IF(LEN(A12),LimitLookup($A12,Regelsæt,4),\"\")","v":""},{"$f":"IF(LEN(A12),LimitLookup($A12,Regelsæt,5),\"\")","v":""},"VL309|MC000007","2,2"]
[{"$f":"IF(I13=\"\",\"\",IF($A$3=\"ELIMS\",IF(ISNA(VLOOKUP(I13,Definitioner!$P$2:$S$381,2,FALSE)),\"\",VLOOKUP(I13,Definitioner!$P$2:$S$381,2,FALSE)),VLOOKUP(I13,Definitioner!$O$2:$S$381,3,FALSE)))","v":50},"C10-C15","mg/kg ts.",{"$f":"IF(LEN(A13),LimitLookup($A13,Regelsæt,1),\"\")","v":"40"},{"$f":"IF(LEN(A13),LimitLookup($A13,Regelsæt,2),\"\")","v":"40"},{"$f":"IF(LEN(A13),LimitLookup($A13,Regelsæt,3),\"\")","v":"40"},{"$f":"IF(LEN(A13),LimitLookup($A13,Regelsæt,4),\"\")","v":""},{"$f":"IF(LEN(A13),LimitLookup($A13,Regelsæt,5),\"\")","v":""},"VL309|CA001572","< 5"]
[{"$f":"IF(I14=\"\",\"\",IF($A$3=\"ELIMS\",IF(ISNA(VLOOKUP(I14,Definitioner!$P$2:$S$381,2,FALSE)),\"\",VLOOKUP(I14,Definitioner!$P$2:$S$381,2,FALSE)),VLOOKUP(I14,Definitioner!$O$2:$S$381,3,FALSE)))","v":49},"C15-C20","mg/kg ts.",{"$f":"IF(LEN(A14),LimitLookup($A14,Regelsæt,1),\"\")","v":"55"},{"$f":"IF(LEN(A14),LimitLookup($A14,Regelsæt,2),\"\")","v":"55"},{"$f":"IF(LEN(A14),LimitLookup($A14,Regelsæt,3),\"\")","v":"55"},{"$f":"IF(LEN(A14),LimitLookup($A14,Regelsæt,4),\"\")","v":""},{"$f":"IF(LEN(A14),LimitLookup($A14,Regelsæt,5),\"\")","v":""},"VL309|CA001573","20"]
[{"$f":"IF(I15=\"\",\"\",IF($A$3=\"ELIMS\",IF(ISNA(VLOOKUP(I15,Definitioner!$P$2:$S$381,2,FALSE)),\"\",VLOOKUP(I15,Definitioner!$P$2:$S$381,2,FALSE)),VLOOKUP(I15,Definitioner!$O$2:$S$381,3,FALSE)))","v":48},"C20-C35","mg/kg ts.",{"$f":"IF(LEN(A15),LimitLookup($A15,Regelsæt,1),\"\")","v":"100"},{"$f":"IF(LEN(A15),LimitLookup($A15,Regelsæt,2),\"\")","v":"300"},{"$f":"IF(LEN(A15),LimitLookup($A15,Regelsæt,3),\"\")","v":"300"},{"$f":"IF(LEN(A15),LimitLookup($A15,Regelsæt,4),\"\")","v":""},{"$f":"IF(LEN(A15),LimitLookup($A15,Regelsæt,5),\"\")","v":""},"VL309|CA00159R","54"]
[{"$f":"IF(I16=\"\",\"\",IF($A$3=\"ELIMS\",IF(ISNA(VLOOKUP(I16,Definitioner!$P$2:$S$381,2,FALSE)),\"\",VLOOKUP(I16,Definitioner!$P$2:$S$381,2,FALSE)),VLOOKUP(I16,Definitioner!$O$2:$S$381,3,FALSE)))","v":52},"Sum (C10-C20)","mg/kg ts.",{"$f":"IF(LEN(A16),LimitLookup($A16,Regelsæt,1),\"\")","v":"-"},{"$f":"IF(LEN(A16),LimitLookup($A16,Regelsæt,2),\"\")","v":"-"},{"$f":"IF(LEN(A16),LimitLookup($A16,Regelsæt,3),\"\")","v":"-"},{"$f":"IF(LEN(A16),LimitLookup($A16,Regelsæt,4),\"\")","v":""},{"$f":"IF(LEN(A16),LimitLookup($A16,Regelsæt,5),\"\")","v":""},"VL309|CA0015CV","20"]
[{"$f":"IF(I17=\"\",\"\",IF($A$3=\"ELIMS\",IF(ISNA(VLOOKUP(I17,Definitioner!$P$2:$S$381,2,FALSE)),\"\",VLOOKUP(I17,Definitioner!$P$2:$S$381,2,FALSE)),VLOOKUP(I17,Definitioner!$O$2:$S$381,3,FALSE)))","v":11},"Sum (C6H6-C35)","mg/kg ts.",{"$f":"IF(LEN(A17),LimitLookup($A17,Regelsæt,1),\"\")","v":"100"},{"$f":"IF(LEN(A17),LimitLookup($A17,Regelsæt,2),\"\")","v":"300"},{"$f":"IF(LEN(A17),LimitLookup($A17,Regelsæt,3),\"\")","v":"300"},{"$f":"IF(LEN(A17),LimitLookup($A17,Regelsæt,4),\"\")","v":""},{"$f":"IF(LEN(A17),LimitLookup($A17,Regelsæt,5),\"\")","v":""},"VL309|MC000004","77"]
[{"$f":"IF(I18=\"\",\"\",IF($A$3=\"ELIMS\",IF(ISNA(VLOOKUP(I18,Definitioner!$P$2:$S$381,2,FALSE)),\"\",VLOOKUP(I18,Definitioner!$P$2:$S$381,2,FALSE)),VLOOKUP(I18,Definitioner!$O$2:$S$381,3,FALSE)))","v":24},"Fluoranthen","mg/kg ts.",{"$f":"IF(LEN(A18),LimitLookup($A18,Regelsæt,1),\"\")","v":"-"},{"$f":"IF(LEN(A18),LimitLookup($A18,Regelsæt,2),\"\")","v":"-"},{"$f":"IF(LEN(A18),LimitLookup($A18,Regelsæt,3),\"\")","v":"-"},{"$f":"IF(LEN(A18),LimitLookup($A18,Regelsæt,4),\"\")","v":""},{"$f":"IF(LEN(A18),LimitLookup($A18,Regelsæt,5),\"\")","v":""},"VL04J|7300A359","0,03"]
[{"$f":"IF(I19=\"\",\"\",IF($A$3=\"ELIMS\",IF(ISNA(VLOOKUP(I19,Definitioner!$P$2:$S$381,2,FALSE)),\"\",VLOOKUP(I19,Definitioner!$P$2:$S$381,2,FALSE)),VLOOKUP(I19,Definitioner!$O$2:$S$381,3,FALSE)))","v":25},"Benzo(b+j+k)fluoranthen","mg/kg ts.",{"$f":"IF(LEN(A19),LimitLookup($A19,Regelsæt,1),\"\")","v":"-"},{"$f":"IF(LEN(A19),LimitLookup($A19,Regelsæt,2),\"\")","v":"-"},{"$f":"IF(LEN(A19),LimitLookup($A19,Regelsæt,3),\"\")","v":"-"},{"$f":"IF(LEN(A19),LimitLookup($A19,Regelsæt,4),\"\")","v":""},{"$f":"IF(LEN(A19),LimitLookup($A19,Regelsæt,5),\"\")","v":""},"VL04N|GF00005X","0,035"]
[{"$f":"IF(I20=\"\",\"\",IF($A$3=\"ELIMS\",IF(ISNA(VLOOKUP(I20,Definitioner!$P$2:$S$381,2,FALSE)),\"\",VLOOKUP(I20,Definitioner!$P$2:$S$381,2,FALSE)),VLOOKUP(I20,Definitioner!$O$2:$S$381,3,FALSE)))","v":19},"Benzo(a)pyren","mg/kg ts.",{"$f":"IF(LEN(A20),LimitLookup($A20,Regelsæt,1),\"\")","v":"0,3"},{"$f":"IF(LEN(A20),LimitLookup($A20,Regelsæt,2),\"\")","v":"3"},{"$f":"IF(LEN(A20),LimitLookup($A20,Regelsæt,3),\"\")","v":"3"},{"$f":"IF(LEN(A20),LimitLookup($A20,Regelsæt,4),\"\")","v":""},{"$f":"IF(LEN(A20),LimitLookup($A20,Regelsæt,5),\"\")","v":""},"VL04C|7300A035","0,021"]
[{"$f":"IF(I21=\"\",\"\",IF($A$3=\"ELIMS\",IF(ISNA(VLOOKUP(I21,Definitioner!$P$2:$S$381,2,FALSE)),\"\",VLOOKUP(I21,Definitioner!$P$2:$S$381,2,FALSE)),VLOOKUP(I21,Definitioner!$O$2:$S$381,3,FALSE)))","v":26},"Indeno(1,2,3-cd)pyren ","mg/kg ts.",{"$f":"IF(LEN(A21),LimitLookup($A21,Regelsæt,1),\"\")","v":"-"},{"$f":"IF(LEN(A21),LimitLookup($A21,Regelsæt,2),\"\")","v":"-"},{"$f":"IF(LEN(A21),LimitLookup($A21,Regelsæt,3),\"\")","v":"-"},{"$f":"IF(LEN(A21),LimitLookup($A21,Regelsæt,4),\"\")","v":""},{"$f":"IF(LEN(A21),LimitLookup($A21,Regelsæt,5),\"\")","v":""},"VL04K|7300A365","0,014"]
[{"$f":"IF(I22=\"\",\"\",IF($A$3=\"ELIMS\",IF(ISNA(VLOOKUP(I22,Definitioner!$P$2:$S$381,2,FALSE)),\"\",VLOOKUP(I22,Definitioner!$P$2:$S$381,2,FALSE)),VLOOKUP(I22,Definitioner!$O$2:$S$381,3,FALSE)))","v":20},"Dibenz(a,h)anthracen","mg/kg ts.",{"$f":"IF(LEN(A22),LimitLookup($A22,Regelsæt,1),\"\")","v":"0,3"},{"$f":"IF(LEN(A22),LimitLookup($A22,Regelsæt,2),\"\")","v":"3"},{"$f":"IF(LEN(A22),LimitLookup($A22,Regelsæt,3),\"\")","v":"3"},{"$f":"IF(LEN(A22),LimitLookup($A22,Regelsæt,4),\"\")","v":""},{"$f":"IF(LEN(A22),LimitLookup($A22,Regelsæt,5),\"\")","v":""},"VL04I|7300A366","< 0,01"]
[{"$f":"IF(I23=\"\",\"\",IF($A$3=\"ELIMS\",IF(ISNA(VLOOKUP(I23,Definitioner!$P$2:$S$381,2,FALSE)),\"\",VLOOKUP(I23,Definitioner!$P$2:$S$381,2,FALSE)),VLOOKUP(I23,Definitioner!$O$2:$S$381,3,FALSE)))","v":18},"Sum af 7 PAH'er","mg/kg ts.",{"$f":"IF(LEN(A23),LimitLookup($A23,Regelsæt,1),\"\")","v":"4"},{"$f":"IF(LEN(A23),LimitLookup($A23,Regelsæt,2),\"\")","v":"40"},{"$f":"IF(LEN(A23),LimitLookup($A23,Regelsæt,3),\"\")","v":"40"},{"$f":"IF(LEN(A23),LimitLookup($A23,Regelsæt,4),\"\")","v":""},{"$f":"IF(LEN(A23),LimitLookup($A23,Regelsæt,5),\"\")","v":""},"VL04B|CA001440","0,10"]
[{"$f":"IF(I24=\"\",\"\",IF($A$3=\"ELIMS\",IF(ISNA(VLOOKUP(I24,Definitioner!$P$2:$S$381,2,FALSE)),\"\",VLOOKUP(I24,Definitioner!$P$2:$S$381,2,FALSE)),VLOOKUP(I24,Definitioner!$O$2:$S$381,3,FALSE)))","v":""},{"$f":"IF(A24<>\"\",VLOOKUP(A24,Definitioner!$A$2:$B$119,2),\"\")","v":""},null,{"$f":"IF(LEN(A24),LimitLookup($A24,Regelsæt,1),\"\")","v":""},{"$f":"IF(LEN(A24),LimitLookup($A24,Regelsæt,2),\"\")","v":""},{"$f":"IF(LEN(A24),LimitLookup($A24,Regelsæt,3),\"\")","v":""},{"$f":"IF(LEN(A24),LimitLookup($A24,Regelsæt,4),\"\")","v":""},{"$f":"IF(LEN(A24),LimitLookup($A24,Regelsæt,5),\"\")","v":""}]
[{"$f":"IF(I25=\"\",\"\",IF($A$3=\"ELIMS\",IF(ISNA(VLOOKUP(I25,Definitioner!$P$2:$S$381,2,FALSE)),\"\",VLOOKUP(I25,Definitioner!$P$2:$S$381,2,FALSE)),VLOOKUP(I25,Definitioner!$O$2:$S$381,3,FALSE)))","v":""},{"$f":"IF(A25<>\"\",VLOOKUP(A25,Definitioner!$A$2:$B$119,2),\"\")","v":""},null,{"$f":"IF(LEN(A25),LimitLookup($A25,Regelsæt,1),\"\")","v":""},{"$f":"IF(LEN(A25),LimitLookup($A25,Regelsæt,2),\"\")","v":""},{"$f":"IF(LEN(A25),LimitLookup($A25,Regelsæt,3),\"\")","v":""},{"$f":"IF(LEN(A25),LimitLookup($A25,Regelsæt,4),\"\")","v":""},{"$f":"IF(LEN(A25),LimitLookup($A25,Regelsæt,5),\"\")","v":""}]
[{"$f":"IF(I26=\"\",\"\",IF($A$3=\"ELIMS\",IF(ISNA(VLOOKUP(I26,Definitioner!$P$2:$S$381,2,FALSE)),\"\",VLOOKUP(I26,Definitioner!$P$2:$S$381,2,FALSE)),VLOOKUP(I26,Definitioner!$O$2:$S$381,3,FALSE)))","v":""},{"$f":"IF(A26<>\"\",VLOOKUP(A26,Definitioner!$A$2:$B$119,2),\"\")","v":""},null,{"$f":"IF(LEN(A26),LimitLookup($A26,Regelsæt,1),\"\")","v":""},{"$f":"IF(LEN(A26),LimitLookup($A26,Regelsæt,2),\"\")","v":""},{"$f":"IF(LEN(A26),LimitLookup($A26,Regelsæt,3),\"\")","v":""},{"$f":"IF(LEN(A26),LimitLookup($A26,Regelsæt,4),\"\")","v":""},{"$f":"IF(LEN(A26),LimitLookup($A26,Regelsæt,5),\"\")","v":""}]
[{"$f":"IF(I27=\"\",\"\",IF($A$3=\"ELIMS\",IF(ISNA(VLOOKUP(I27,Definitioner!$P$2:$S$381,2,FALSE)),\"\",VLOOKUP(I27,Definitioner!$P$2:$S$381,2,FALSE)),VLOOKUP(I27,Definitioner!$O$2:$S$381,3,FALSE)))","v":""},{"$f":"IF(A27<>\"\",VLOOKUP(A27,Definitioner!$A$2:$B$119,2),\"\")","v":""},null,{"$f":"IF(LEN(A27),LimitLookup($A27,Regelsæt,1),\"\")","v":""},{"$f":"IF(LEN(A27),LimitLookup($A27,Regelsæt,2),\"\")","v":""},{"$f":"IF(LEN(A27),LimitLookup($A27,Regelsæt,3),\"\")","v":""},{"$f":"IF(LEN(A27),LimitLookup($A27,Regelsæt,4),\"\")","v":""},{"$f":"IF(LEN(A27),LimitLookup($A27,Regelsæt,5),\"\")","v":""}]
[{"$f":"IF(I28=\"\",\"\",IF($A$3=\"ELIMS\",IF(ISNA(VLOOKUP(I28,Definitioner!$P$2:$S$381,2,FALSE)),\"\",VLOOKUP(I28,Definitioner!$P$2:$S$381,2,FALSE)),VLOOKUP(I28,Definitioner!$O$2:$S$381,3,FALSE)))","v":""},{"$f":"IF(A28<>\"\",VLOOKUP(A28,Definitioner!$A$2:$B$119,2),\"\")","v":""},null,{"$f":"IF(LEN(A28),LimitLookup($A28,Regelsæt,1),\"\")","v":""},{"$f":"IF(LEN(A28),LimitLookup($A28,Regelsæt,2),\"\")","v":""},{"$f":"IF(LEN(A28),LimitLookup($A28,Regelsæt,3),\"\")","v":""},{"$f":"IF(LEN(A28),LimitLookup($A28,Regelsæt,4),\"\")","v":""},{"$f":"IF(LEN(A28),LimitLookup($A28,Regelsæt,5),\"\")","v":""}]
[{"$f":"IF(I29=\"\",\"\",IF($A$3=\"ELIMS\",IF(ISNA(VLOOKUP(I29,Definitioner!$P$2:$S$381,2,FALSE)),\"\",VLOOKUP(I29,Definitioner!$P$2:$S$381,2,FALSE)),VLOOKUP(I29,Definitioner!$O$2:$S$381,3,FALSE)))","v":""},{"$f":"IF(A29<>\"\",VLOOKUP(A29,Definitioner!$A$2:$B$119,2),\"\")","v":""},null,{"$f":"IF(LEN(A29),LimitLookup($A29,Regelsæt,1),\"\")","v":""},{"$f":"IF(LEN(A29),LimitLookup($A29,Regelsæt,2),\"\")","v":""},{"$f":"IF(LEN(A29),LimitLookup($A29,Regelsæt,3),\"\")","v":""},{"$f":"IF(LEN(A29),LimitLookup($A29,Regelsæt,4),\"\")","v":""},{"$f":"IF(LEN(A29),LimitLookup($A29,Regelsæt,5),\"\")","v":""}]
[{"$f":"IF(I30=\"\",\"\",IF($A$3=\"ELIMS\",IF(ISNA(VLOOKUP(I30,Definitioner!$P$2:$S$381,2,FALSE)),\"\",VLOOKUP(I30,Definitioner!$P$2:$S$381,2,FALSE)),VLOOKUP(I30,Definitioner!$O$2:$S$381,3,FALSE)))","v":""},{"$f":"IF(A30<>\"\",VLOOKUP(A30,Definitioner!$A$2:$B$119,2),\"\")","v":""},null,{"$f":"IF(LEN(A30),LimitLookup($A30,Regelsæt,1),\"\")","v":""},{"$f":"IF(LEN(A30),LimitLookup($A30,Regelsæt,2),\"\")","v":""},{"$f":"IF(LEN(A30),LimitLookup($A30,Regelsæt,3),\"\")","v":""},{"$f":"IF(LEN(A30),LimitLookup($A30,Regelsæt,4),\"\")","v":""},{"$f":"IF(LEN(A30),LimitLookup($A30,Regelsæt,5),\"\")","v":""}]
[{"$f":"IF(I31=\"\",\"\",IF($A$3=\"ELIMS\",IF(ISNA(VLOOKUP(I31,Definitioner!$P$2:$S$381,2,FALSE)),\"\",VLOOKUP(I31,Definitioner!$P$2:$S$381,2,FALSE)),VLOOKUP(I31,Definitioner!$O$2:$S$381,3,FALSE)))","v":""},{"$f":"IF(A31<>\"\",VLOOKUP(A31,Definitioner!$A$2:$B$119,2),\"\")","v":""},null,{"$f":"IF(LEN(A31),LimitLookup($A31,Regelsæt,1),\"\")","v":""},{"$f":"IF(LEN(A31),LimitLookup($A31,Regelsæt,2),\"\")","v":""},{"$f":"IF(LEN(A31),LimitLookup($A31,Regelsæt,3),\"\")","v":""},{"$f":"IF(LEN(A31),LimitLookup($A31,Regelsæt,4),\"\")","v":""},{"$f":"IF(LEN(A31),LimitLookup($A31,Regelsæt,5),\"\")","v":""}]
[{"$f":"IF(I32=\"\",\"\",IF($A$3=\"ELIMS\",IF(ISNA(VLOOKUP(I32,Definitioner!$P$2:$S$381,2,FALSE)),\"\",VLOOKUP(I32,Definitioner!$P$2:$S$381,2,FALSE)),VLOOKUP(I32,Definitioner!$O$2:$S$381,3,FALSE)))","v":""},{"$f":"IF(A32<>\"\",VLOOKUP(A32,Definitioner!$A$2:$B$119,2),\"\")","v":""},null,{"$f":"IF(LEN(A32),LimitLookup($A32,Regelsæt,1),\"\")","v":""},{"$f":"IF(LEN(A32),LimitLookup($A32,Regelsæt,2),\"\")","v":""},{"$f":"IF(LEN(A32),LimitLookup($A32,Regelsæt,3),\"\")","v":""},{"$f":"IF(LEN(A32),LimitLookup($A32,Regelsæt,4),\"\")","v":""},{"$f":"IF(LEN(A32),LimitLookup($A32,Regelsæt,5),\"\")","v":""}]
[{"$f":"IF(I33=\"\",\"\",IF($A$3=\"ELIMS\",IF(ISNA(VLOOKUP(I33,Definitioner!$P$2:$S$381,2,FALSE)),\"\",VLOOKUP(I33,Definitioner!$P$2:$S$381,2,FALSE)),VLOOKUP(I33,Definitioner!$O$2:$S$381,3,FALSE)))","v":""},{"$f":"IF(A33<>\"\",VLOOKUP(A33,Definitioner!$A$2:$B$119,2),\"\")","v":""},null,{"$f":"IF(LEN(A33),LimitLookup($A33,Regelsæt,1),\"\")","v":""},{"$f":"IF(LEN(A33),LimitLookup($A33,Regelsæt,2),\"\")","v":""},{"$f":"IF(LEN(A33),LimitLookup($A33,Regelsæt,3),\"\")","v":""},{"$f":"IF(LEN(A33),LimitLookup($A33,Regelsæt,4),\"\")","v":""},{"$f":"IF(LEN(A33),LimitLookup($A33,Regelsæt,5),\"\")","v":""}]
[{"$f":"IF(I34=\"\",\"\",IF($A$3=\"ELIMS\",IF(ISNA(VLOOKUP(I34,Definitioner!$P$2:$S$381,2,FALSE)),\"\",VLOOKUP(I34,Definitioner!$P$2:$S$381,2,FALSE)),VLOOKUP(I34,Definitioner!$O$2:$S$381,3,FALSE)))","v":""},{"$f":"IF(A34<>\"\",VLOOKUP(A34,Definitioner!$A$2:$B$119,2),\"\")","v":""},null,{"$f":"IF(LEN(A34),LimitLookup($A34,Regelsæt,1),\"\")","v":""},{"$f":"IF(LEN(A34),LimitLookup($A34,Regelsæt,2),\"\")","v":""},{"$f":"IF(LEN(A34),LimitLookup($A34,Regelsæt,3),\"\")","v":""},{"$f":"IF(LEN(A34),LimitLookup($A34,Regelsæt,4),\"\")","v":""},{"$f":"IF(LEN(A34),LimitLookup($A34,Regelsæt,5),\"\")","v":""}]
[{"$f":"IF(I35=\"\",\"\",IF($A$3=\"ELIMS\",IF(ISNA(VLOOKUP(I35,Definitioner!$P$2:$S$381,2,FALSE)),\"\",VLOOKUP(I35,Definitioner!$P$2:$S$381,2,FALSE)),VLOOKUP(I35,Definitioner!$O$2:$S$381,3,FALSE)))","v":""},{"$f":"IF(A35<>\"\",VLOOKUP(A35,Definitioner!$A$2:$B$119,2),\"\")","v":""},null,{"$f":"IF(LEN(A35),LimitLookup($A35,Regelsæt,1),\"\")","v":""},{"$f":"IF(LEN(A35),LimitLookup($A35,Regelsæt,2),\"\")","v":""},{"$f":"IF(LEN(A35),LimitLookup($A35,Regelsæt,3),\"\")","v":""},{"$f":"IF(LEN(A35),LimitLookup($A35,Regelsæt,4),\"\")","v":""},{"$f":"IF(LEN(A35),LimitLookup($A35,Regelsæt,5),\"\")","v":""}]
[{"$f":"IF(I36=\"\",\"\",IF($A$3=\"ELIMS\",IF(ISNA(VLOOKUP(I36,Definitioner!$P$2:$S$381,2,FALSE)),\"\",VLOOKUP(I36,Definitioner!$P$2:$S$381,2,FALSE)),VLOOKUP(I36,Definitioner!$O$2:$S$381,3,FALSE)))","v":""},{"$f":"IF(A36<>\"\",VLOOKUP(A36,Definitioner!$A$2:$B$119,2),\"\")","v":""},null,{"$f":"IF(LEN(A36),LimitLookup($A36,Regelsæt,1),\"\")","v":""},{"$f":"IF(LEN(A36),LimitLookup($A36,Regelsæt,2),\"\")","v":""},{"$f":"IF(LEN(A36),LimitLookup($A36,Regelsæt,3),\"\")","v":""},{"$f":"IF(LEN(A36),LimitLookup($A36,Regelsæt,4),\"\")","v":""},{"$f":"IF(LEN(A36),LimitLookup($A36,Regelsæt,5),\"\")","v":""}]
[{"$f":"IF(I37=\"\",\"\",IF($A$3=\"ELIMS\",IF(ISNA(VLOOKUP(I37,Definitioner!$P$2:$S$381,2,FALSE)),\"\",VLOOKUP(I37,Definitioner!$P$2:$S$381,2,FALSE)),VLOOKUP(I37,Definitioner!$O$2:$S$381,3,FALSE)))","v":""},{"$f":"IF(A37<>\"\",VLOOKUP(A37,Definitioner!$A$2:$B$119,2),\"\")","v":""},null,{"$f":"IF(LEN(A37),LimitLookup($A37,Regelsæt,1),\"\")","v":""},{"$f":"IF(LEN(A37),LimitLookup($A37,Regelsæt,2),\"\")","v":""},{"$f":"IF(LEN(A37),LimitLookup($A37,Regelsæt,3),\"\")","v":""},{"$f":"IF(LEN(A37),LimitLookup($A37,Regelsæt,4),\"\")","v":""},{"$f":"IF(LEN(A37),LimitLookup($A37,Regelsæt,5),\"\")","v":""}]
[{"$f":"IF(I38=\"\",\"\",IF($A$3=\"ELIMS\",IF(ISNA(VLOOKUP(I38,Definitioner!$P$2:$S$381,2,FALSE)),\"\",VLOOKUP(I38,Definitioner!$P$2:$S$381,2,FALSE)),VLOOKUP(I38,Definitioner!$O$2:$S$381,3,FALSE)))","v":""},{"$f":"IF(A38<>\"\",VLOOKUP(A38,Definitioner!$A$2:$B$119,2),\"\")","v":""},null,{"$f":"IF(LEN(A38),LimitLookup($A38,Regelsæt,1),\"\")","v":""},{"$f":"IF(LEN(A38),LimitLookup($A38,Regelsæt,2),\"\")","v":""},{"$f":"IF(LEN(A38),LimitLookup($A38,Regelsæt,3),\"\")","v":""},{"$f":"IF(LEN(A38),LimitLookup($A38,Regelsæt,4),\"\")","v":""},{"$f":"IF(LEN(A38),LimitLookup($A38,Regelsæt,5),\"\")","v":""}]
[{"$f":"IF(I39=\"\",\"\",IF($A$3=\"ELIMS\",IF(ISNA(VLOOKUP(I39,Definitioner!$P$2:$S$381,2,FALSE)),\"\",VLOOKUP(I39,Definitioner!$P$2:$S$381,2,FALSE)),VLOOKUP(I39,Definitioner!$O$2:$S$381,3,FALSE)))","v":""},{"$f":"IF(A39<>\"\",VLOOKUP(A39,Definitioner!$A$2:$B$119,2),\"\")","v":""},null,{"$f":"IF(LEN(A39),LimitLookup($A39,Regelsæt,1),\"\")","v":""},{"$f":"IF(LEN(A39),LimitLookup($A39,Regelsæt,2),\"\")","v":""},{"$f":"IF(LEN(A39),LimitLookup($A39,Regelsæt,3),\"\")","v":""},{"$f":"IF(LEN(A39),LimitLookup($A39,Regelsæt,4),\"\")","v":""},{"$f":"IF(LEN(A39),LimitLookup($A39,Regelsæt,5),\"\")","v":""}]
[{"$f":"IF(I40=\"\",\"\",IF($A$3=\"ELIMS\",IF(ISNA(VLOOKUP(I40,Definitioner!$P$2:$S$381,2,FALSE)),\"\",VLOOKUP(I40,Definitioner!$P$2:$S$381,2,FALSE)),VLOOKUP(I40,Definitioner!$O$2:$S$381,3,FALSE)))","v":""},{"$f":"IF(A40<>\"\",VLOOKUP(A40,Definitioner!$A$2:$B$119,2),\"\")","v":""},null,{"$f":"IF(LEN(A40),LimitLookup($A40,Regelsæt,1),\"\")","v":""},{"$f":"IF(LEN(A40),LimitLookup($A40,Regelsæt,2),\"\")","v":""},{"$f":"IF(LEN(A40),LimitLookup($A40,Regelsæt,3),\"\")","v":""},{"$f":"IF(LEN(A40),LimitLookup($A40,Regelsæt,4),\"\")","v":""},{"$f":"IF(LEN(A40),LimitLookup($A40,Regelsæt,5),\"\")","v":""}]
[{"$f":"IF(I41=\"\",\"\",IF($A$3=\"ELIMS\",IF(ISNA(VLOOKUP(I41,Definitioner!$P$2:$S$381,2,FALSE)),\"\",VLOOKUP(I41,Definitioner!$P$2:$S$381,2,FALSE)),VLOOKUP(I41,Definitioner!$O$2:$S$381,3,FALSE)))","v":""},{"$f":"IF(A41<>\"\",VLOOKUP(A41,Definitioner!$A$2:$B$119,2),\"\")","v":""},null,{"$f":"IF(LEN(A41),LimitLookup($A41,Regelsæt,1),\"\")","v":""},{"$f":"IF(LEN(A41),LimitLookup($A41,Regelsæt,2),\"\")","v":""},{"$f":"IF(LEN(A41),LimitLookup($A41,Regelsæt,3),\"\")","v":""},{"$f":"IF(LEN(A41),LimitLookup($A41,Regelsæt,4),\"\")","v":""},{"$f":"IF(LEN(A41),LimitLookup($A41,Regelsæt,5),\"\")","v":""}]
[{"$f":"IF(I42=\"\",\"\",IF($A$3=\"ELIMS\",IF(ISNA(VLOOKUP(I42,Definitioner!$P$2:$S$381,2,FALSE)),\"\",VLOOKUP(I42,Definitioner!$P$2:$S$381,2,FALSE)),VLOOKUP(I42,Definitioner!$O$2:$S$381,3,FALSE)))","v":""},{"$f":"IF(A42<>\"\",VLOOKUP(A42,Definitioner!$A$2:$B$119,2),\"\")","v":""},null,{"$f":"IF(LEN(A42),LimitLookup($A42,Regelsæt,1),\"\")","v":""},{"$f":"IF(LEN(A42),LimitLookup($A42,Regelsæt,2),\"\")","v":""},{"$f":"IF(LEN(A42),LimitLookup($A42,Regelsæt,3),\"\")","v":""},{"$f":"IF(LEN(A42),LimitLookup($A42,Regelsæt,4),\"\")","v":""},{"$f":"IF(LEN(A42),LimitLookup($A42,Regelsæt,5),\"\")","v":""}]
[{"$f":"IF(I43=\"\",\"\",IF($A$3=\"ELIMS\",IF(ISNA(VLOOKUP(I43,Definitioner!$P$2:$S$381,2,FALSE)),\"\",VLOOKUP(I43,Definitioner!$P$2:$S$381,2,FALSE)),VLOOKUP(I43,Definitioner!$O$2:$S$381,3,FALSE)))","v":""},{"$f":"IF(A43<>\"\",VLOOKUP(A43,Definitioner!$A$2:$B$119,2),\"\")","v":""},null,{"$f":"IF(LEN(A43),LimitLookup($A43,Regelsæt,1),\"\")","v":""},{"$f":"IF(LEN(A43),LimitLookup($A43,Regelsæt,2),\"\")","v":""},{"$f":"IF(LEN(A43),LimitLookup($A43,Regelsæt,3),\"\")","v":""},{"$f":"IF(LEN(A43),LimitLookup($A43,Regelsæt,4),\"\")","v":""},{"$f":"IF(LEN(A43),LimitLookup($A43,Regelsæt,5),\"\")","v":""}]
[{"$f":"IF(I44=\"\",\"\",IF($A$3=\"ELIMS\",IF(ISNA(VLOOKUP(I44,Definitioner!$P$2:$S$381,2,FALSE)),\"\",VLOOKUP(I44,Definitioner!$P$2:$S$381,2,FALSE)),VLOOKUP(I44,Definitioner!$O$2:$S$381,3,FALSE)))","v":""},{"$f":"IF(A44<>\"\",VLOOKUP(A44,Definitioner!$A$2:$B$119,2),\"\")","v":""},null,{"$f":"IF(LEN(A44),LimitLookup($A44,Regelsæt,1),\"\")","v":""},{"$f":"IF(LEN(A44),LimitLookup($A44,Regelsæt,2),\"\")","v":""},{"$f":"IF(LEN(A44),LimitLookup($A44,Regelsæt,3),\"\")","v":""},{"$f":"IF(LEN(A44),LimitLookup($A44,Regelsæt,4),\"\")","v":""},{"$f":"IF(LEN(A44),LimitLookup($A44,Regelsæt,5),\"\")","v":""}]
[{"$f":"IF(I45=\"\",\"\",IF($A$3=\"ELIMS\",IF(ISNA(VLOOKUP(I45,Definitioner!$P$2:$S$381,2,FALSE)),\"\",VLOOKUP(I45,Definitioner!$P$2:$S$381,2,FALSE)),VLOOKUP(I45,Definitioner!$O$2:$S$381,3,FALSE)))","v":""},{"$f":"IF(A45<>\"\",VLOOKUP(A45,Definitioner!$A$2:$B$119,2),\"\")","v":""},null,{"$f":"IF(LEN(A45),LimitLookup($A45,Regelsæt,1),\"\")","v":""},{"$f":"IF(LEN(A45),LimitLookup($A45,Regelsæt,2),\"\")","v":""},{"$f":"IF(LEN(A45),LimitLookup($A45,Regelsæt,3),\"\")","v":""},{"$f":"IF(LEN(A45),LimitLookup($A45,Regelsæt,4),\"\")","v":""},{"$f":"IF(LEN(A45),LimitLookup($A45,Regelsæt,5),\"\")","v":""}]
[{"$f":"IF(I46=\"\",\"\",IF($A$3=\"ELIMS\",IF(ISNA(VLOOKUP(I46,Definitioner!$P$2:$S$381,2,FALSE)),\"\",VLOOKUP(I46,Definitioner!$P$2:$S$381,2,FALSE)),VLOOKUP(I46,Definitioner!$O$2:$S$381,3,FALSE)))","v":""},{"$f":"IF(A46<>\"\",VLOOKUP(A46,Definitioner!$A$2:$B$119,2),\"\")","v":""},null,{"$f":"IF(LEN(A46),LimitLookup($A46,Regelsæt,1),\"\")","v":""},{"$f":"IF(LEN(A46),LimitLookup($A46,Regelsæt,2),\"\")","v":""},{"$f":"IF(LEN(A46),LimitLookup($A46,Regelsæt,3),\"\")","v":""},{"$f":"IF(LEN(A46),LimitLookup($A46,Regelsæt,4),\"\")","v":""},{"$f":"IF(LEN(A46),LimitLookup($A46,Regelsæt,5),\"\")","v":""}]
[{"$f":"IF(I47=\"\",\"\",IF($A$3=\"ELIMS\",IF(ISNA(VLOOKUP(I47,Definitioner!$P$2:$S$381,2,FALSE)),\"\",VLOOKUP(I47,Definitioner!$P$2:$S$381,2,FALSE)),VLOOKUP(I47,Definitioner!$O$2:$S$381,3,FALSE)))","v":""},{"$f":"IF(A47<>\"\",VLOOKUP(A47,Definitioner!$A$2:$B$119,2),\"\")","v":""},null,{"$f":"IF(LEN(A47),LimitLookup($A47,Regelsæt,1),\"\")","v":""},{"$f":"IF(LEN(A47),LimitLookup($A47,Regelsæt,2),\"\")","v":""},{"$f":"IF(LEN(A47),LimitLookup($A47,Regelsæt,3),\"\")","v":""},{"$f":"IF(LEN(A47),LimitLookup($A47,Regelsæt,4),\"\")","v":""},{"$f":"IF(LEN(A47),LimitLookup($A47,Regelsæt,5),\"\")","v":""}]
[{"$f":"IF(I48=\"\",\"\",IF($A$3=\"ELIMS\",IF(ISNA(VLOOKUP(I48,Definitioner!$P$2:$S$381,2,FALSE)),\"\",VLOOKUP(I48,Definitioner!$P$2:$S$381,2,FALSE)),VLOOKUP(I48,Definitioner!$O$2:$S$381,3,FALSE)))","v":""},{"$f":"IF(A48<>\"\",VLOOKUP(A48,Definitioner!$A$2:$B$119,2),\"\")","v":""},null,{"$f":"IF(LEN(A48),LimitLookup($A48,Regelsæt,1),\"\")","v":""},{"$f":"IF(LEN(A48),LimitLookup($A48,Regelsæt,2),\"\")","v":""},{"$f":"IF(LEN(A48),LimitLookup($A48,Regelsæt,3),\"\")","v":""},{"$f":"IF(LEN(A48),LimitLookup($A48,Regelsæt,4),\"\")","v":""},{"$f":"IF(LEN(A48),LimitLookup($A48,Regelsæt,5),\"\")","v":""}]
[{"$f":"IF(I49=\"\",\"\",IF($A$3=\"ELIMS\",IF(ISNA(VLOOKUP(I49,Definitioner!$P$2:$S$381,2,FALSE)),\"\",VLOOKUP(I49,Definitioner!$P$2:$S$381,2,FALSE)),VLOOKUP(I49,Definitioner!$O$2:$S$381,3,FALSE)))","v":""},{"$f":"IF(A49<>\"\",VLOOKUP(A49,Definitioner!$A$2:$B$119,2),\"\")","v":""},null,{"$f":"IF(LEN(A49),LimitLookup($A49,Regelsæt,1),\"\")","v":""},{"$f":"IF(LEN(A49),LimitLookup($A49,Regelsæt,2),\"\")","v":""},{"$f":"IF(LEN(A49),LimitLookup($A49,Regelsæt,3),\"\")","v":""},{"$f":"IF(LEN(A49),LimitLookup($A49,Regelsæt,4),\"\")","v":""},{"$f":"IF(LEN(A49),LimitLookup($A49,Regelsæt,5),\"\")","v":""}]
[{"$f":"IF(I50=\"\",\"\",IF($A$3=\"ELIMS\",IF(ISNA(VLOOKUP(I50,Definitioner!$P$2:$S$381,2,FALSE)),\"\",VLOOKUP(I50,Definitioner!$P$2:$S$381,2,FALSE)),VLOOKUP(I50,Definitioner!$O$2:$S$381,3,FALSE)))","v":""},{"$f":"IF(A50<>\"\",VLOOKUP(A50,Definitioner!$A$2:$B$119,2),\"\")","v":""},null,{"$f":"IF(LEN(A50),LimitLookup($A50,Regelsæt,1),\"\")","v":""},{"$f":"IF(LEN(A50),LimitLookup($A50,Regelsæt,2),\"\")","v":""},{"$f":"IF(LEN(A50),LimitLookup($A50,Regelsæt,3),\"\")","v":""},{"$f":"IF(LEN(A50),LimitLookup($A50,Regelsæt,4),\"\")","v":""},{"$f":"IF(LEN(A50),LimitLookup($A50,Regelsæt,5),\"\")","v":""}]
[{"$f":"IF(I51=\"\",\"\",IF($A$3=\"ELIMS\",IF(ISNA(VLOOKUP(I51,Definitioner!$P$2:$S$381,2,FALSE)),\"\",VLOOKUP(I51,Definitioner!$P$2:$S$381,2,FALSE)),VLOOKUP(I51,Definitioner!$O$2:$S$381,3,FALSE)))","v":""},{"$f":"IF(A51<>\"\",VLOOKUP(A51,Definitioner!$A$2:$B$119,2),\"\")","v":""},null,{"$f":"IF(LEN(A51),LimitLookup($A51,Regelsæt,1),\"\")","v":""},{"$f":"IF(LEN(A51),LimitLookup($A51,Regelsæt,2),\"\")","v":""},{"$f":"IF(LEN(A51),LimitLookup($A51,Regelsæt,3),\"\")","v":""},{"$f":"IF(LEN(A51),LimitLookup($A51,Regelsæt,4),\"\")","v":""},{"$f":"IF(LEN(A51),LimitLookup($A51,Regelsæt,5),\"\")","v":""}]
[{"$f":"IF(I52=\"\",\"\",IF($A$3=\"ELIMS\",IF(ISNA(VLOOKUP(I52,Definitioner!$P$2:$S$381,2,FALSE)),\"\",VLOOKUP(I52,Definitioner!$P$2:$S$381,2,FALSE)),VLOOKUP(I52,Definitioner!$O$2:$S$381,3,FALSE)))","v":""},{"$f":"IF(A52<>\"\",VLOOKUP(A52,Definitioner!$A$2:$B$119,2),\"\")","v":""},null,{"$f":"IF(LEN(A52),LimitLookup($A52,Regelsæt,1),\"\")","v":""},{"$f":"IF(LEN(A52),LimitLookup($A52,Regelsæt,2),\"\")","v":""},{"$f":"IF(LEN(A52),LimitLookup($A52,Regelsæt,3),\"\")","v":""},{"$f":"IF(LEN(A52),LimitLookup($A52,Regelsæt,4),\"\")","v":""},{"$f":"IF(LEN(A52),LimitLookup($A52,Regelsæt,5),\"\")","v":""}]
[{"$f":"IF(I53=\"\",\"\",IF($A$3=\"ELIMS\",IF(ISNA(VLOOKUP(I53,Definitioner!$P$2:$S$381,2,FALSE)),\"\",VLOOKUP(I53,Definitioner!$P$2:$S$381,2,FALSE)),VLOOKUP(I53,Definitioner!$O$2:$S$381,3,FALSE)))","v":""},{"$f":"IF(A53<>\"\",VLOOKUP(A53,Definitioner!$A$2:$B$119,2),\"\")","v":""},null,{"$f":"IF(LEN(A53),LimitLookup($A53,Regelsæt,1),\"\")","v":""},{"$f":"IF(LEN(A53),LimitLookup($A53,Regelsæt,2),\"\")","v":""},{"$f":"IF(LEN(A53),LimitLookup($A53,Regelsæt,3),\"\")","v":""},{"$f":"IF(LEN(A53),LimitLookup($A53,Regelsæt,4),\"\")","v":""},{"$f":"IF(LEN(A53),LimitLookup($A53,Regelsæt,5),\"\")","v":""}]
[{"$f":"IF(I54=\"\",\"\",IF($A$3=\"ELIMS\",IF(ISNA(VLOOKUP(I54,Definitioner!$P$2:$S$381,2,FALSE)),\"\",VLOOKUP(I54,Definitioner!$P$2:$S$381,2,FALSE)),VLOOKUP(I54,Definitioner!$O$2:$S$381,3,FALSE)))","v":""},{"$f":"IF(A54<>\"\",VLOOKUP(A54,Definitioner!$A$2:$B$119,2),\"\")","v":""},null,{"$f":"IF(LEN(A54),LimitLookup($A54,Regelsæt,1),\"\")","v":""},{"$f":"IF(LEN(A54),LimitLookup($A54,Regelsæt,2),\"\")","v":""},{"$f":"IF(LEN(A54),LimitLookup($A54,Regelsæt,3),\"\")","v":""},{"$f":"IF(LEN(A54),LimitLookup($A54,Regelsæt,4),\"\")","v":""},{"$f":"IF(LEN(A54),LimitLookup($A54,Regelsæt,5),\"\")","v":""}]
[{"$f":"IF(I55=\"\",\"\",IF($A$3=\"ELIMS\",IF(ISNA(VLOOKUP(I55,Definitioner!$P$2:$S$381,2,FALSE)),\"\",VLOOKUP(I55,Definitioner!$P$2:$S$381,2,FALSE)),VLOOKUP(I55,Definitioner!$O$2:$S$381,3,FALSE)))","v":""},{"$f":"IF(A55<>\"\",VLOOKUP(A55,Definitioner!$A$2:$B$119,2),\"\")","v":""},null,{"$f":"IF(LEN(A55),LimitLookup($A55,Regelsæt,1),\"\")","v":""},{"$f":"IF(LEN(A55),LimitLookup($A55,Regelsæt,2),\"\")","v":""},{"$f":"IF(LEN(A55),LimitLookup($A55,Regelsæt,3),\"\")","v":""},{"$f":"IF(LEN(A55),LimitLookup($A55,Regelsæt,4),\"\")","v":""},{"$f":"IF(LEN(A55),LimitLookup($A55,Regelsæt,5),\"\")","v":""}]
[{"$f":"IF(I56=\"\",\"\",IF($A$3=\"ELIMS\",IF(ISNA(VLOOKUP(I56,Definitioner!$P$2:$S$381,2,FALSE)),\"\",VLOOKUP(I56,Definitioner!$P$2:$S$381,2,FALSE)),VLOOKUP(I56,Definitioner!$O$2:$S$381,3,FALSE)))","v":""},{"$f":"IF(A56<>\"\",VLOOKUP(A56,Definitioner!$A$2:$B$119,2),\"\")","v":""},null,{"$f":"IF(LEN(A56),LimitLookup($A56,Regelsæt,1),\"\")","v":""},{"$f":"IF(LEN(A56),LimitLookup($A56,Regelsæt,2),\"\")","v":""},{"$f":"IF(LEN(A56),LimitLookup($A56,Regelsæt,3),\"\")","v":""},{"$f":"IF(LEN(A56),LimitLookup($A56,Regelsæt,4),\"\")","v":""},{"$f":"IF(LEN(A56),LimitLookup($A56,Regelsæt,5),\"\")","v":""}]
[{"$f":"IF(I57=\"\",\"\",IF($A$3=\"ELIMS\",IF(ISNA(VLOOKUP(I57,Definitioner!$P$2:$S$381,2,FALSE)),\"\",VLOOKUP(I57,Definitioner!$P$2:$S$381,2,FALSE)),VLOOKUP(I57,Definitioner!$O$2:$S$381,3,FALSE)))","v":""},{"$f":"IF(A57<>\"\",VLOOKUP(A57,Definitioner!$A$2:$B$119,2),\"\")","v":""},null,{"$f":"IF(LEN(A57),LimitLookup($A57,Regelsæt,1),\"\")","v":""},{"$f":"IF(LEN(A57),LimitLookup($A57,Regelsæt,2),\"\")","v":""},{"$f":"IF(LEN(A57),LimitLookup($A57,Regelsæt,3),\"\")","v":""},{"$f":"IF(LEN(A57),LimitLookup($A57,Regelsæt,4),\"\")","v":""},{"$f":"IF(LEN(A57),LimitLookup($A57,Regelsæt,5),\"\")","v":""}]
[{"$f":"IF(I58=\"\",\"\",IF($A$3=\"ELIMS\",IF(ISNA(VLOOKUP(I58,Definitioner!$P$2:$S$381,2,FALSE)),\"\",VLOOKUP(I58,Definitioner!$P$2:$S$381,2,FALSE)),VLOOKUP(I58,Definitioner!$O$2:$S$381,3,FALSE)))","v":""},{"$f":"IF(A58<>\"\",VLOOKUP(A58,Definitioner!$A$2:$B$119,2),\"\")","v":""},null,{"$f":"IF(LEN(A58),LimitLookup($A58,Regelsæt,1),\"\")","v":""},{"$f":"IF(LEN(A58),LimitLookup($A58,Regelsæt,2),\"\")","v":""},{"$f":"IF(LEN(A58),LimitLookup($A58,Regelsæt,3),\"\")","v":""},{"$f":"IF(LEN(A58),LimitLookup($A58,Regelsæt,4),\"\")","v":""},{"$f":"IF(LEN(A58),LimitLookup($A58,Regelsæt,5),\"\")","v":""}]
[{"$f":"IF(I59=\"\",\"\",IF($A$3=\"ELIMS\",IF(ISNA(VLOOKUP(I59,Definitioner!$P$2:$S$381,2,FALSE)),\"\",VLOOKUP(I59,Definitioner!$P$2:$S$381,2,FALSE)),VLOOKUP(I59,Definitioner!$O$2:$S$381,3,FALSE)))","v":""},{"$f":"IF(A59<>\"\",VLOOKUP(A59,Definitioner!$A$2:$B$119,2),\"\")","v":""},null,{"$f":"IF(LEN(A59),LimitLookup($A59,Regelsæt,1),\"\")","v":""},{"$f":"IF(LEN(A59),LimitLookup($A59,Regelsæt,2),\"\")","v":""},{"$f":"IF(LEN(A59),LimitLookup($A59,Regelsæt,3),\"\")","v":""},{"$f":"IF(LEN(A59),LimitLookup($A59,Regelsæt,4),\"\")","v":""},{"$f":"IF(LEN(A59),LimitLookup($A59,Regelsæt,5),\"\")","v":""}]
[{"$f":"IF(I60=\"\",\"\",IF($A$3=\"ELIMS\",IF(ISNA(VLOOKUP(I60,Definitioner!$P$2:$S$381,2,FALSE)),\"\",VLOOKUP(I60,Definitioner!$P$2:$S$381,2,FALSE)),VLOOKUP(I60,Definitioner!$O$2:$S$381,3,FALSE)))","v":""},{"$f":"IF(A60<>\"\",VLOOKUP(A60,Definitioner!$A$2:$B$119,2),\"\")","v":""},null,{"$f":"IF(LEN(A60),LimitLookup($A60,Regelsæt,1),\"\")","v":""},{"$f":"IF(LEN(A60),LimitLookup($A60,Regelsæt,2),\"\")","v":""},{"$f":"IF(LEN(A60),LimitLookup($A60,Regelsæt,3),\"\")","v":""},{"$f":"IF(LEN(A60),LimitLookup($A60,Regelsæt,4),\"\")","v":""},{"$f":"IF(LEN(A60),LimitLookup($A60,Regelsæt,5),\"\")","v":""}]
[{"$f":"IF(I61=\"\",\"\",IF($A$3=\"ELIMS\",IF(ISNA(VLOOKUP(I61,Definitioner!$P$2:$S$381,2,FALSE)),\"\",VLOOKUP(I61,Definitioner!$P$2:$S$381,2,FALSE)),VLOOKUP(I61,Definitioner!$O$2:$S$381,3,FALSE)))","v":""},{"$f":"IF(A61<>\"\",VLOOKUP(A61,Definitioner!$A$2:$B$119,2),\"\")","v":""},null,{"$f":"IF(LEN(A61),LimitLookup($A61,Regelsæt,1),\"\")","v":""},{"$f":"IF(LEN(A61),LimitLookup($A61,Regelsæt,2),\"\")","v":""},{"$f":"IF(LEN(A61),LimitLookup($A61,Regelsæt,3),\"\")","v":""},{"$f":"IF(LEN(A61),LimitLookup($A61,Regelsæt,4),\"\")","v":""},{"$f":"IF(LEN(A61),LimitLookup($A61,Regelsæt,5),\"\")","v":""}]
[{"$f":"IF(I62=\"\",\"\",IF($A$3=\"ELIMS\",IF(ISNA(VLOOKUP(I62,Definitioner!$P$2:$S$381,2,FALSE)),\"\",VLOOKUP(I62,Definitioner!$P$2:$S$381,2,FALSE)),VLOOKUP(I62,Definitioner!$O$2:$S$381,3,FALSE)))","v":""},{"$f":"IF(A62<>\"\",VLOOKUP(A62,Definitioner!$A$2:$B$119,2),\"\")","v":""},null,{"$f":"IF(LEN(A62),LimitLookup($A62,Regelsæt,1),\"\")","v":""},{"$f":"IF(LEN(A62),LimitLookup($A62,Regelsæt,2),\"\")","v":""},{"$f":"IF(LEN(A62),LimitLookup($A62,Regelsæt,3),\"\")","v":""},{"$f":"IF(LEN(A62),LimitLookup($A62,Regelsæt,4),\"\")","v":""},{"$f":"IF(LEN(A62),LimitLookup($A62,Regelsæt,5),\"\")","v":""}]
[{"$f":"IF(I63=\"\",\"\",IF($A$3=\"ELIMS\",IF(ISNA(VLOOKUP(I63,Definitioner!$P$2:$S$381,2,FALSE)),\"\",VLOOKUP(I63,Definitioner!$P$2:$S$381,2,FALSE)),VLOOKUP(I63,Definitioner!$O$2:$S$381,3,FALSE)))","v":""},{"$f":"IF(A63<>\"\",VLOOKUP(A63,Definitioner!$A$2:$B$119,2),\"\")","v":""},null,{"$f":"IF(LEN(A63),LimitLookup($A63,Regelsæt,1),\"\")","v":""},{"$f":"IF(LEN(A63),LimitLookup($A63,Regelsæt,2),\"\")","v":""},{"$f":"IF(LEN(A63),LimitLookup($A63,Regelsæt,3),\"\")","v":""},{"$f":"IF(LEN(A63),LimitLookup($A63,Regelsæt,4),\"\")","v":""},{"$f":"IF(LEN(A63),LimitLookup($A63,Regelsæt,5),\"\")","v":""}]
[{"$f":"IF(I64=\"\",\"\",IF($A$3=\"ELIMS\",IF(ISNA(VLOOKUP(I64,Definitioner!$P$2:$S$381,2,FALSE)),\"\",VLOOKUP(I64,Definitioner!$P$2:$S$381,2,FALSE)),VLOOKUP(I64,Definitioner!$O$2:$S$381,3,FALSE)))","v":""},{"$f":"IF(A64<>\"\",VLOOKUP(A64,Definitioner!$A$2:$B$119,2),\"\")","v":""},null,{"$f":"IF(LEN(A64),LimitLookup($A64,Regelsæt,1),\"\")","v":""},{"$f":"IF(LEN(A64),LimitLookup($A64,Regelsæt,2),\"\")","v":""},{"$f":"IF(LEN(A64),LimitLookup($A64,Regelsæt,3),\"\")","v":""},{"$f":"IF(LEN(A64),LimitLookup($A64,Regelsæt,4),\"\")","v":""},{"$f":"IF(LEN(A64),LimitLookup($A64,Regelsæt,5),\"\")","v":""}]
[{"$f":"IF(I65=\"\",\"\",IF($A$3=\"ELIMS\",IF(ISNA(VLOOKUP(I65,Definitioner!$P$2:$S$381,2,FALSE)),\"\",VLOOKUP(I65,Definitioner!$P$2:$S$381,2,FALSE)),VLOOKUP(I65,Definitioner!$O$2:$S$381,3,FALSE)))","v":""},{"$f":"IF(A65<>\"\",VLOOKUP(A65,Definitioner!$A$2:$B$119,2),\"\")","v":""},null,{"$f":"IF(LEN(A65),LimitLookup($A65,Regelsæt,1),\"\")","v":""},{"$f":"IF(LEN(A65),LimitLookup($A65,Regelsæt,2),\"\")","v":""},{"$f":"IF(LEN(A65),LimitLookup($A65,Regelsæt,3),\"\")","v":""},{"$f":"IF(LEN(A65),LimitLookup($A65,Regelsæt,4),\"\")","v":""},{"$f":"IF(LEN(A65),LimitLookup($A65,Regelsæt,5),\"\")","v":""}]
[{"$f":"IF(I66=\"\",\"\",IF($A$3=\"ELIMS\",IF(ISNA(VLOOKUP(I66,Definitioner!$P$2:$S$381,2,FALSE)),\"\",VLOOKUP(I66,Definitioner!$P$2:$S$381,2,FALSE)),VLOOKUP(I66,Definitioner!$O$2:$S$381,3,FALSE)))","v":""},{"$f":"IF(A66<>\"\",VLOOKUP(A66,Definitioner!$A$2:$B$119,2),\"\")","v":""},null,{"$f":"IF(LEN(A66),LimitLookup($A66,Regelsæt,1),\"\")","v":""},{"$f":"IF(LEN(A66),LimitLookup($A66,Regelsæt,2),\"\")","v":""},{"$f":"IF(LEN(A66),LimitLookup($A66,Regelsæt,3),\"\")","v":""},{"$f":"IF(LEN(A66),LimitLookup($A66,Regelsæt,4),\"\")","v":""},{"$f":"IF(LEN(A66),LimitLookup($A66,Regelsæt,5),\"\")","v":""}]
[{"$f":"IF(I67=\"\",\"\",IF($A$3=\"ELIMS\",IF(ISNA(VLOOKUP(I67,Definitioner!$P$2:$S$381,2,FALSE)),\"\",VLOOKUP(I67,Definitioner!$P$2:$S$381,2,FALSE)),VLOOKUP(I67,Definitioner!$O$2:$S$381,3,FALSE)))","v":""},{"$f":"IF(A67<>\"\",VLOOKUP(A67,Definitioner!$A$2:$B$119,2),\"\")","v":""},null,{"$f":"IF(LEN(A67),LimitLookup($A67,Regelsæt,1),\"\")","v":""},{"$f":"IF(LEN(A67),LimitLookup($A67,Regelsæt,2),\"\")","v":""},{"$f":"IF(LEN(A67),LimitLookup($A67,Regelsæt,3),\"\")","v":""},{"$f":"IF(LEN(A67),LimitLookup($A67,Regelsæt,4),\"\")","v":""},{"$f":"IF(LEN(A67),LimitLookup($A67,Regelsæt,5),\"\")","v":""}]
[{"$f":"IF(I68=\"\",\"\",IF($A$3=\"ELIMS\",IF(ISNA(VLOOKUP(I68,Definitioner!$P$2:$S$381,2,FALSE)),\"\",VLOOKUP(I68,Definitioner!$P$2:$S$381,2,FALSE)),VLOOKUP(I68,Definitioner!$O$2:$S$381,3,FALSE)))","v":""},{"$f":"IF(A68<>\"\",VLOOKUP(A68,Definitioner!$A$2:$B$119,2),\"\")","v":""},null,{"$f":"IF(LEN(A68),LimitLookup($A68,Regelsæt,1),\"\")","v":""},{"$f":"IF(LEN(A68),LimitLookup($A68,Regelsæt,2),\"\")","v":""},{"$f":"IF(LEN(A68),LimitLookup($A68,Regelsæt,3),\"\")","v":""},{"$f":"IF(LEN(A68),LimitLookup($A68,Regelsæt,4),\"\")","v":""},{"$f":"IF(LEN(A68),LimitLookup($A68,Regelsæt,5),\"\")","v":""}]
[{"$f":"IF(I69=\"\",\"\",IF($A$3=\"ELIMS\",IF(ISNA(VLOOKUP(I69,Definitioner!$P$2:$S$381,2,FALSE)),\"\",VLOOKUP(I69,Definitioner!$P$2:$S$381,2,FALSE)),VLOOKUP(I69,Definitioner!$O$2:$S$381,3,FALSE)))","v":""},{"$f":"IF(A69<>\"\",VLOOKUP(A69,Definitioner!$A$2:$B$119,2),\"\")","v":""},null,{"$f":"IF(LEN(A69),LimitLookup($A69,Regelsæt,1),\"\")","v":""},{"$f":"IF(LEN(A69),LimitLookup($A69,Regelsæt,2),\"\")","v":""},{"$f":"IF(LEN(A69),LimitLookup($A69,Regelsæt,3),\"\")","v":""},{"$f":"IF(LEN(A69),LimitLookup($A69,Regelsæt,4),\"\")","v":""},{"$f":"IF(LEN(A69),LimitLookup($A69,Regelsæt,5),\"\")","v":""}]
[{"$f":"IF(I70=\"\",\"\",IF($A$3=\"ELIMS\",IF(ISNA(VLOOKUP(I70,Definitioner!$P$2:$S$381,2,FALSE)),\"\",VLOOKUP(I70,Definitioner!$P$2:$S$381,2,FALSE)),VLOOKUP(I70,Definitioner!$O$2:$S$381,3,FALSE)))","v":""},{"$f":"IF(A70<>\"\",VLOOKUP(A70,Definitioner!$A$2:$B$119,2),\"\")","v":""},null,{"$f":"IF(LEN(A70),LimitLookup($A70,Regelsæt,1),\"\")","v":""},{"$f":"IF(LEN(A70),LimitLookup($A70,Regelsæt,2),\"\")","v":""},{"$f":"IF(LEN(A70),LimitLookup($A70,Regelsæt,3),\"\")","v":""},{"$f":"IF(LEN(A70),LimitLookup($A70,Regelsæt,4),\"\")","v":""},{"$f":"IF(LEN(A70),LimitLookup($A70,Regelsæt,5),\"\")","v":""}]
[{"$f":"IF(I71=\"\",\"\",IF($A$3=\"ELIMS\",IF(ISNA(VLOOKUP(I71,Definitioner!$P$2:$S$381,2,FALSE)),\"\",VLOOKUP(I71,Definitioner!$P$2:$S$381,2,FALSE)),VLOOKUP(I71,Definitioner!$O$2:$S$381,3,FALSE)))","v":""},{"$f":"IF(A71<>\"\",VLOOKUP(A71,Definitioner!$A$2:$B$119,2),\"\")","v":""},null,{"$f":"IF(LEN(A71),LimitLookup($A71,Regelsæt,1),\"\")","v":""},{"$f":"IF(LEN(A71),LimitLookup($A71,Regelsæt,2),\"\")","v":""},{"$f":"IF(LEN(A71),LimitLookup($A71,Regelsæt,3),\"\")","v":""},{"$f":"IF(LEN(A71),LimitLookup($A71,Regelsæt,4),\"\")","v":""},{"$f":"IF(LEN(A71),LimitLookup($A71,Regelsæt,5),\"\")","v":""}]
[{"$f":"IF(I72=\"\",\"\",IF($A$3=\"ELIMS\",IF(ISNA(VLOOKUP(I72,Definitioner!$P$2:$S$381,2,FALSE)),\"\",VLOOKUP(I72,Definitioner!$P$2:$S$381,2,FALSE)),VLOOKUP(I72,Definitioner!$O$2:$S$381,3,FALSE)))","v":""},{"$f":"IF(A72<>\"\",VLOOKUP(A72,Definitioner!$A$2:$B$119,2),\"\")","v":""},null,{"$f":"IF(LEN(A72),LimitLookup($A72,Regelsæt,1),\"\")","v":""},{"$f":"IF(LEN(A72),LimitLookup($A72,Regelsæt,2),\"\")","v":""},{"$f":"IF(LEN(A72),LimitLookup($A72,Regelsæt,3),\"\")","v":""},{"$f":"IF(LEN(A72),LimitLookup($A72,Regelsæt,4),\"\")","v":""},{"$f":"IF(LEN(A72),LimitLookup($A72,Regelsæt,5),\"\")","v":""}]
[{"$f":"IF(I73=\"\",\"\",IF($A$3=\"ELIMS\",IF(ISNA(VLOOKUP(I73,Definitioner!$P$2:$S$381,2,FALSE)),\"\",VLOOKUP(I73,Definitioner!$P$2:$S$381,2,FALSE)),VLOOKUP(I73,Definitioner!$O$2:$S$381,3,FALSE)))","v":""},{"$f":"IF(A73<>\"\",VLOOKUP(A73,Definitioner!$A$2:$B$119,2),\"\")","v":""},null,{"$f":"IF(LEN(A73),LimitLookup($A73,Regelsæt,1),\"\")","v":""},{"$f":"IF(LEN(A73),LimitLookup($A73,Regelsæt,2),\"\")","v":""},{"$f":"IF(LEN(A73),LimitLookup($A73,Regelsæt,3),\"\")","v":""},{"$f":"IF(LEN(A73),LimitLookup($A73,Regelsæt,4),\"\")","v":""},{"$f":"IF(LEN(A73),LimitLookup($A73,Regelsæt,5),\"\")","v":""}]
[{"$f":"IF(I74=\"\",\"\",IF($A$3=\"ELIMS\",IF(ISNA(VLOOKUP(I74,Definitioner!$P$2:$S$381,2,FALSE)),\"\",VLOOKUP(I74,Definitioner!$P$2:$S$381,2,FALSE)),VLOOKUP(I74,Definitioner!$O$2:$S$381,3,FALSE)))","v":""},{"$f":"IF(A74<>\"\",VLOOKUP(A74,Definitioner!$A$2:$B$119,2),\"\")","v":""},null,{"$f":"IF(LEN(A74),LimitLookup($A74,Regelsæt,1),\"\")","v":""},{"$f":"IF(LEN(A74),LimitLookup($A74,Regelsæt,2),\"\")","v":""},{"$f":"IF(LEN(A74),LimitLookup($A74,Regelsæt,3),\"\")","v":""},{"$f":"IF(LEN(A74),LimitLookup($A74,Regelsæt,4),\"\")","v":""},{"$f":"IF(LEN(A74),LimitLookup($A74,Regelsæt,5),\"\")","v":""}]
[{"$f":"IF(I75=\"\",\"\",IF($A$3=\"ELIMS\",IF(ISNA(VLOOKUP(I75,Definitioner!$P$2:$S$381,2,FALSE)),\"\",VLOOKUP(I75,Definitioner!$P$2:$S$381,2,FALSE)),VLOOKUP(I75,Definitioner!$O$2:$S$381,3,FALSE)))","v":""},{"$f":"IF(A75<>\"\",VLOOKUP(A75,Definitioner!$A$2:$B$119,2),\"\")","v":""},null,{"$f":"IF(LEN(A75),LimitLookup($A75,Regelsæt,1),\"\")","v":""},{"$f":"IF(LEN(A75),LimitLookup($A75,Regelsæt,2),\"\")","v":""},{"$f":"IF(LEN(A75),LimitLookup($A75,Regelsæt,3),\"\")","v":""},{"$f":"IF(LEN(A75),LimitLookup($A75,Regelsæt,4),\"\")","v":""},{"$f":"IF(LEN(A75),LimitLookup($A75,Regelsæt,5),\"\")","v":""}]
[{"$f":"IF(I76=\"\",\"\",IF($A$3=\"ELIMS\",IF(ISNA(VLOOKUP(I76,Definitioner!$P$2:$S$381,2,FALSE)),\"\",VLOOKUP(I76,Definitioner!$P$2:$S$381,2,FALSE)),VLOOKUP(I76,Definitioner!$O$2:$S$381,3,FALSE)))","v":""},{"$f":"IF(A76<>\"\",VLOOKUP(A76,Definitioner!$A$2:$B$119,2),\"\")","v":""},null,{"$f":"IF(LEN(A76),LimitLookup($A76,Regelsæt,1),\"\")","v":""},{"$f":"IF(LEN(A76),LimitLookup($A76,Regelsæt,2),\"\")","v":""},{"$f":"IF(LEN(A76),LimitLookup($A76,Regelsæt,3),\"\")","v":""},{"$f":"IF(LEN(A76),LimitLookup($A76,Regelsæt,4),\"\")","v":""},{"$f":"IF(LEN(A76),LimitLookup($A76,Regelsæt,5),\"\")","v":""}]
[{"$f":"IF(I77=\"\",\"\",IF($A$3=\"ELIMS\",IF(ISNA(VLOOKUP(I77,Definitioner!$P$2:$S$381,2,FALSE)),\"\",VLOOKUP(I77,Definitioner!$P$2:$S$381,2,FALSE)),VLOOKUP(I77,Definitioner!$O$2:$S$381,3,FALSE)))","v":""},{"$f":"IF(A77<>\"\",VLOOKUP(A77,Definitioner!$A$2:$B$119,2),\"\")","v":""},null,{"$f":"IF(LEN(A77),LimitLookup($A77,Regelsæt,1),\"\")","v":""},{"$f":"IF(LEN(A77),LimitLookup($A77,Regelsæt,2),\"\")","v":""},{"$f":"IF(LEN(A77),LimitLookup($A77,Regelsæt,3),\"\")","v":""},{"$f":"IF(LEN(A77),LimitLookup($A77,Regelsæt,4),\"\")","v":""},{"$f":"IF(LEN(A77),LimitLookup($A77,Regelsæt,5),\"\")","v":""}]
[{"$f":"IF(I78=\"\",\"\",IF($A$3=\"ELIMS\",IF(ISNA(VLOOKUP(I78,Definitioner!$P$2:$S$381,2,FALSE)),\"\",VLOOKUP(I78,Definitioner!$P$2:$S$381,2,FALSE)),VLOOKUP(I78,Definitioner!$O$2:$S$381,3,FALSE)))","v":""},{"$f":"IF(A78<>\"\",VLOOKUP(A78,Definitioner!$A$2:$B$119,2),\"\")","v":""},null,{"$f":"IF(LEN(A78),LimitLookup($A78,Regelsæt,1),\"\")","v":""},{"$f":"IF(LEN(A78),LimitLookup($A78,Regelsæt,2),\"\")","v":""},{"$f":"IF(LEN(A78),LimitLookup($A78,Regelsæt,3),\"\")","v":""},{"$f":"IF(LEN(A78),LimitLookup($A78,Regelsæt,4),\"\")","v":""},{"$f":"IF(LEN(A78),LimitLookup($A78,Regelsæt,5),\"\")","v":""}]
[{"$f":"IF(I79=\"\",\"\",IF($A$3=\"ELIMS\",IF(ISNA(VLOOKUP(I79,Definitioner!$P$2:$S$381,2,FALSE)),\"\",VLOOKUP(I79,Definitioner!$P$2:$S$381,2,FALSE)),VLOOKUP(I79,Definitioner!$O$2:$S$381,3,FALSE)))","v":""},{"$f":"IF(A79<>\"\",VLOOKUP(A79,Definitioner!$A$2:$B$119,2),\"\")","v":""},null,{"$f":"IF(LEN(A79),LimitLookup($A79,Regelsæt,1),\"\")","v":""},{"$f":"IF(LEN(A79),LimitLookup($A79,Regelsæt,2),\"\")","v":""},{"$f":"IF(LEN(A79),LimitLookup($A79,Regelsæt,3),\"\")","v":""},{"$f":"IF(LEN(A79),LimitLookup($A79,Regelsæt,4),\"\")","v":""},{"$f":"IF(LEN(A79),LimitLookup($A79,Regelsæt,5),\"\")","v":""}]
[{"$f":"IF(I80=\"\",\"\",IF($A$3=\"ELIMS\",IF(ISNA(VLOOKUP(I80,Definitioner!$P$2:$S$381,2,FALSE)),\"\",VLOOKUP(I80,Definitioner!$P$2:$S$381,2,FALSE)),VLOOKUP(I80,Definitioner!$O$2:$S$381,3,FALSE)))","v":""},{"$f":"IF(A80<>\"\",VLOOKUP(A80,Definitioner!$A$2:$B$119,2),\"\")","v":""},null,{"$f":"IF(LEN(A80),LimitLookup($A80,Regelsæt,1),\"\")","v":""},{"$f":"IF(LEN(A80),LimitLookup($A80,Regelsæt,2),\"\")","v":""},{"$f":"IF(LEN(A80),LimitLookup($A80,Regelsæt,3),\"\")","v":""},{"$f":"IF(LEN(A80),LimitLookup($A80,Regelsæt,4),\"\")","v":""},{"$f":"IF(LEN(A80),LimitLookup($A80,Regelsæt,5),\"\")","v":""}]
[{"$f":"IF(I81=\"\",\"\",IF($A$3=\"ELIMS\",IF(ISNA(VLOOKUP(I81,Definitioner!$P$2:$S$381,2,FALSE)),\"\",VLOOKUP(I81,Definitioner!$P$2:$S$381,2,FALSE)),VLOOKUP(I81,Definitioner!$O$2:$S$381,3,FALSE)))","v":""},{"$f":"IF(A81<>\"\",VLOOKUP(A81,Definitioner!$A$2:$B$119,2),\"\")","v":""},null,{"$f":"IF(LEN(A81),LimitLookup($A81,Regelsæt,1),\"\")","v":""},{"$f":"IF(LEN(A81),LimitLookup($A81,Regelsæt,2),\"\")","v":""},{"$f":"IF(LEN(A81),LimitLookup($A81,Regelsæt,3),\"\")","v":""},{"$f":"IF(LEN(A81),LimitLookup($A81,Regelsæt,4),\"\")","v":""},{"$f":"IF(LEN(A81),LimitLookup($A81,Regelsæt,5),\"\")","v":""}]
[{"$f":"IF(I82=\"\",\"\",IF($A$3=\"ELIMS\",IF(ISNA(VLOOKUP(I82,Definitioner!$P$2:$S$381,2,FALSE)),\"\",VLOOKUP(I82,Definitioner!$P$2:$S$381,2,FALSE)),VLOOKUP(I82,Definitioner!$O$2:$S$381,3,FALSE)))","v":""},{"$f":"IF(A82<>\"\",VLOOKUP(A82,Definitioner!$A$2:$B$119,2),\"\")","v":""},null,{"$f":"IF(LEN(A82),LimitLookup($A82,Regelsæt,1),\"\")","v":""},{"$f":"IF(LEN(A82),LimitLookup($A82,Regelsæt,2),\"\")","v":""},{"$f":"IF(LEN(A82),LimitLookup($A82,Regelsæt,3),\"\")","v":""},{"$f":"IF(LEN(A82),LimitLookup($A82,Regelsæt,4),\"\")","v":""},{"$f":"IF(LEN(A82),LimitLookup($A82,Regelsæt,5),\"\")","v":""}]
[{"$f":"IF(I83=\"\",\"\",IF($A$3=\"ELIMS\",IF(ISNA(VLOOKUP(I83,Definitioner!$P$2:$S$381,2,FALSE)),\"\",VLOOKUP(I83,Definitioner!$P$2:$S$381,2,FALSE)),VLOOKUP(I83,Definitioner!$O$2:$S$381,3,FALSE)))","v":""},{"$f":"IF(A83<>\"\",VLOOKUP(A83,Definitioner!$A$2:$B$119,2),\"\")","v":""},null,{"$f":"IF(LEN(A83),LimitLookup($A83,Regelsæt,1),\"\")","v":""},{"$f":"IF(LEN(A83),LimitLookup($A83,Regelsæt,2),\"\")","v":""},{"$f":"IF(LEN(A83),LimitLookup($A83,Regelsæt,3),\"\")","v":""},{"$f":"IF(LEN(A83),LimitLookup($A83,Regelsæt,4),\"\")","v":""},{"$f":"IF(LEN(A83),LimitLookup($A83,Regelsæt,5),\"\")","v":""}]
[{"$f":"IF(I84=\"\",\"\",IF($A$3=\"ELIMS\",IF(ISNA(VLOOKUP(I84,Definitioner!$P$2:$S$381,2,FALSE)),\"\",VLOOKUP(I84,Definitioner!$P$2:$S$381,2,FALSE)),VLOOKUP(I84,Definitioner!$O$2:$S$381,3,FALSE)))","v":""},{"$f":"IF(A84<>\"\",VLOOKUP(A84,Definitioner!$A$2:$B$119,2),\"\")","v":""},null,{"$f":"IF(LEN(A84),LimitLookup($A84,Regelsæt,1),\"\")","v":""},{"$f":"IF(LEN(A84),LimitLookup($A84,Regelsæt,2),\"\")","v":""},{"$f":"IF(LEN(A84),LimitLookup($A84,Regelsæt,3),\"\")","v":""},{"$f":"IF(LEN(A84),LimitLookup($A84,Regelsæt,4),\"\")","v":""},{"$f":"IF(LEN(A84),LimitLookup($A84,Regelsæt,5),\"\")","v":""}]
[{"$f":"IF(I85=\"\",\"\",IF($A$3=\"ELIMS\",IF(ISNA(VLOOKUP(I85,Definitioner!$P$2:$S$381,2,FALSE)),\"\",VLOOKUP(I85,Definitioner!$P$2:$S$381,2,FALSE)),VLOOKUP(I85,Definitioner!$O$2:$S$381,3,FALSE)))","v":""},{"$f":"IF(A85<>\"\",VLOOKUP(A85,Definitioner!$A$2:$B$119,2),\"\")","v":""},null,{"$f":"IF(LEN(A85),LimitLookup($A85,Regelsæt,1),\"\")","v":""},{"$f":"IF(LEN(A85),LimitLookup($A85,Regelsæt,2),\"\")","v":""},{"$f":"IF(LEN(A85),LimitLookup($A85,Regelsæt,3),\"\")","v":""},{"$f":"IF(LEN(A85),LimitLookup($A85,Regelsæt,4),\"\")","v":""},{"$f":"IF(LEN(A85),LimitLookup($A85,Regelsæt,5),\"\")","v":""}]
[{"$f":"IF(I86=\"\",\"\",IF($A$3=\"ELIMS\",IF(ISNA(VLOOKUP(I86,Definitioner!$P$2:$S$381,2,FALSE)),\"\",VLOOKUP(I86,Definitioner!$P$2:$S$381,2,FALSE)),VLOOKUP(I86,Definitioner!$O$2:$S$381,3,FALSE)))","v":""},{"$f":"IF(A86<>\"\",VLOOKUP(A86,Definitioner!$A$2:$B$119,2),\"\")","v":""},null,{"$f":"IF(LEN(A86),LimitLookup($A86,Regelsæt,1),\"\")","v":""},{"$f":"IF(LEN(A86),LimitLookup($A86,Regelsæt,2),\"\")","v":""},{"$f":"IF(LEN(A86),LimitLookup($A86,Regelsæt,3),\"\")","v":""},{"$f":"IF(LEN(A86),LimitLookup($A86,Regelsæt,4),\"\")","v":""},{"$f":"IF(LEN(A86),LimitLookup($A86,Regelsæt,5),\"\")","v":""}]
[{"$f":"IF(I87=\"\",\"\",IF($A$3=\"ELIMS\",IF(ISNA(VLOOKUP(I87,Definitioner!$P$2:$S$381,2,FALSE)),\"\",VLOOKUP(I87,Definitioner!$P$2:$S$381,2,FALSE)),VLOOKUP(I87,Definitioner!$O$2:$S$381,3,FALSE)))","v":""},{"$f":"IF(A87<>\"\",VLOOKUP(A87,Definitioner!$A$2:$B$119,2),\"\")","v":""},null,{"$f":"IF(LEN(A87),LimitLookup($A87,Regelsæt,1),\"\")","v":""},{"$f":"IF(LEN(A87),LimitLookup($A87,Regelsæt,2),\"\")","v":""},{"$f":"IF(LEN(A87),LimitLookup($A87,Regelsæt,3),\"\")","v":""},{"$f":"IF(LEN(A87),LimitLookup($A87,Regelsæt,4),\"\")","v":""},{"$f":"IF(LEN(A87),LimitLookup($A87,Regelsæt,5),\"\")","v":""}]
[{"$f":"IF(I88=\"\",\"\",IF($A$3=\"ELIMS\",IF(ISNA(VLOOKUP(I88,Definitioner!$P$2:$S$381,2,FALSE)),\"\",VLOOKUP(I88,Definitioner!$P$2:$S$381,2,FALSE)),VLOOKUP(I88,Definitioner!$O$2:$S$381,3,FALSE)))","v":""},{"$f":"IF(A88<>\"\",VLOOKUP(A88,Definitioner!$A$2:$B$119,2),\"\")","v":""},null,{"$f":"IF(LEN(A88),LimitLookup($A88,Regelsæt,1),\"\")","v":""},{"$f":"IF(LEN(A88),LimitLookup($A88,Regelsæt,2),\"\")","v":""},{"$f":"IF(LEN(A88),LimitLookup($A88,Regelsæt,3),\"\")","v":""},{"$f":"IF(LEN(A88),LimitLookup($A88,Regelsæt,4),\"\")","v":""},{"$f":"IF(LEN(A88),LimitLookup($A88,Regelsæt,5),\"\")","v":""}]
[{"$f":"IF(I89=\"\",\"\",IF($A$3=\"ELIMS\",IF(ISNA(VLOOKUP(I89,Definitioner!$P$2:$S$381,2,FALSE)),\"\",VLOOKUP(I89,Definitioner!$P$2:$S$381,2,FALSE)),VLOOKUP(I89,Definitioner!$O$2:$S$381,3,FALSE)))","v":""},{"$f":"IF(A89<>\"\",VLOOKUP(A89,Definitioner!$A$2:$B$119,2),\"\")","v":""},null,{"$f":"IF(LEN(A89),LimitLookup($A89,Regelsæt,1),\"\")","v":""},{"$f":"IF(LEN(A89),LimitLookup($A89,Regelsæt,2),\"\")","v":""},{"$f":"IF(LEN(A89),LimitLookup($A89,Regelsæt,3),\"\")","v":""},{"$f":"IF(LEN(A89),LimitLookup($A89,Regelsæt,4),\"\")","v":""},{"$f":"IF(LEN(A89),LimitLookup($A89,Regelsæt,5),\"\")","v":""}]
[{"$f":"IF(I90=\"\",\"\",IF($A$3=\"ELIMS\",IF(ISNA(VLOOKUP(I90,Definitioner!$P$2:$S$381,2,FALSE)),\"\",VLOOKUP(I90,Definitioner!$P$2:$S$381,2,FALSE)),VLOOKUP(I90,Definitioner!$O$2:$S$381,3,FALSE)))","v":""},{"$f":"IF(A90<>\"\",VLOOKUP(A90,Definitioner!$A$2:$B$119,2),\"\")","v":""},null,{"$f":"IF(LEN(A90),LimitLookup($A90,Regelsæt,1),\"\")","v":""},{"$f":"IF(LEN(A90),LimitLookup($A90,Regelsæt,2),\"\")","v":""},{"$f":"IF(LEN(A90),LimitLookup($A90,Regelsæt,3),\"\")","v":""},{"$f":"IF(LEN(A90),LimitLookup($A90,Regelsæt,4),\"\")","v":""},{"$f":"IF(LEN(A90),LimitLookup($A90,Regelsæt,5),\"\")","v":""}]
[{"$f":"IF(I91=\"\",\"\",IF($A$3=\"ELIMS\",IF(ISNA(VLOOKUP(I91,Definitioner!$P$2:$S$381,2,FALSE)),\"\",VLOOKUP(I91,Definitioner!$P$2:$S$381,2,FALSE)),VLOOKUP(I91,Definitioner!$O$2:$S$381,3,FALSE)))","v":""},{"$f":"IF(A91<>\"\",VLOOKUP(A91,Definitioner!$A$2:$B$119,2),\"\")","v":""},null,{"$f":"IF(LEN(A91),LimitLookup($A91,Regelsæt,1),\"\")","v":""},{"$f":"IF(LEN(A91),LimitLookup($A91,Regelsæt,2),\"\")","v":""},{"$f":"IF(LEN(A91),LimitLookup($A91,Regelsæt,3),\"\")","v":""},{"$f":"IF(LEN(A91),LimitLookup($A91,Regelsæt,4),\"\")","v":""},{"$f":"IF(LEN(A91),LimitLookup($A91,Regelsæt,5),\"\")","v":""}]
[{"$f":"IF(I92=\"\",\"\",IF($A$3=\"ELIMS\",IF(ISNA(VLOOKUP(I92,Definitioner!$P$2:$S$381,2,FALSE)),\"\",VLOOKUP(I92,Definitioner!$P$2:$S$381,2,FALSE)),VLOOKUP(I92,Definitioner!$O$2:$S$381,3,FALSE)))","v":""},{"$f":"IF(A92<>\"\",VLOOKUP(A92,Definitioner!$A$2:$B$119,2),\"\")","v":""},null,{"$f":"IF(LEN(A92),LimitLookup($A92,Regelsæt,1),\"\")","v":""},{"$f":"IF(LEN(A92),LimitLookup($A92,Regelsæt,2),\"\")","v":""},{"$f":"IF(LEN(A92),LimitLookup($A92,Regelsæt,3),\"\")","v":""},{"$f":"IF(LEN(A92),LimitLookup($A92,Regelsæt,4),\"\")","v":""},{"$f":"IF(LEN(A92),LimitLookup($A92,Regelsæt,5),\"\")","v":""}]
[{"$f":"IF(I93=\"\",\"\",IF($A$3=\"ELIMS\",IF(ISNA(VLOOKUP(I93,Definitioner!$P$2:$S$381,2,FALSE)),\"\",VLOOKUP(I93,Definitioner!$P$2:$S$381,2,FALSE)),VLOOKUP(I93,Definitioner!$O$2:$S$381,3,FALSE)))","v":""},{"$f":"IF(A93<>\"\",VLOOKUP(A93,Definitioner!$A$2:$B$119,2),\"\")","v":""},null,{"$f":"IF(LEN(A93),LimitLookup($A93,Regelsæt,1),\"\")","v":""},{"$f":"IF(LEN(A93),LimitLookup($A93,Regelsæt,2),\"\")","v":""},{"$f":"IF(LEN(A93),LimitLookup($A93,Regelsæt,3),\"\")","v":""},{"$f":"IF(LEN(A93),LimitLookup($A93,Regelsæt,4),\"\")","v":""},{"$f":"IF(LEN(A93),LimitLookup($A93,Regelsæt,5),\"\")","v":""}]
[{"$f":"IF(I94=\"\",\"\",IF($A$3=\"ELIMS\",IF(ISNA(VLOOKUP(I94,Definitioner!$P$2:$S$381,2,FALSE)),\"\",VLOOKUP(I94,Definitioner!$P$2:$S$381,2,FALSE)),VLOOKUP(I94,Definitioner!$O$2:$S$381,3,FALSE)))","v":""},{"$f":"IF(A94<>\"\",VLOOKUP(A94,Definitioner!$A$2:$B$119,2),\"\")","v":""},null,{"$f":"IF(LEN(A94),LimitLookup($A94,Regelsæt,1),\"\")","v":""},{"$f":"IF(LEN(A94),LimitLookup($A94,Regelsæt,2),\"\")","v":""},{"$f":"IF(LEN(A94),LimitLookup($A94,Regelsæt,3),\"\")","v":""},{"$f":"IF(LEN(A94),LimitLookup($A94,Regelsæt,4),\"\")","v":""},{"$f":"IF(LEN(A94),LimitLookup($A94,Regelsæt,5),\"\")","v":""}]
[{"$f":"IF(I95=\"\",\"\",IF($A$3=\"ELIMS\",IF(ISNA(VLOOKUP(I95,Definitioner!$P$2:$S$381,2,FALSE)),\"\",VLOOKUP(I95,Definitioner!$P$2:$S$381,2,FALSE)),VLOOKUP(I95,Definitioner!$O$2:$S$381,3,FALSE)))","v":""},{"$f":"IF(A95<>\"\",VLOOKUP(A95,Definitioner!$A$2:$B$119,2),\"\")","v":""},null,{"$f":"IF(LEN(A95),LimitLookup($A95,Regelsæt,1),\"\")","v":""},{"$f":"IF(LEN(A95),LimitLookup($A95,Regelsæt,2),\"\")","v":""},{"$f":"IF(LEN(A95),LimitLookup($A95,Regelsæt,3),\"\")","v":""},{"$f":"IF(LEN(A95),LimitLookup($A95,Regelsæt,4),\"\")","v":""},{"$f":"IF(LEN(A95),LimitLookup($A95,Regelsæt,5),\"\")","v":""}]
[{"$f":"IF(I96=\"\",\"\",IF($A$3=\"ELIMS\",IF(ISNA(VLOOKUP(I96,Definitioner!$P$2:$S$381,2,FALSE)),\"\",VLOOKUP(I96,Definitioner!$P$2:$S$381,2,FALSE)),VLOOKUP(I96,Definitioner!$O$2:$S$381,3,FALSE)))","v":""},{"$f":"IF(A96<>\"\",VLOOKUP(A96,Definitioner!$A$2:$B$119,2),\"\")","v":""},null,{"$f":"IF(LEN(A96),LimitLookup($A96,Regelsæt,1),\"\")","v":""},{"$f":"IF(LEN(A96),LimitLookup($A96,Regelsæt,2),\"\")","v":""},{"$f":"IF(LEN(A96),LimitLookup($A96,Regelsæt,3),\"\")","v":""},{"$f":"IF(LEN(A96),LimitLookup($A96,Regelsæt,4),\"\")","v":""},{"$f":"IF(LEN(A96),LimitLookup($A96,Regelsæt,5),\"\")","v":""}]
[{"$f":"IF(I97=\"\",\"\",IF($A$3=\"ELIMS\",IF(ISNA(VLOOKUP(I97,Definitioner!$P$2:$S$381,2,FALSE)),\"\",VLOOKUP(I97,Definitioner!$P$2:$S$381,2,FALSE)),VLOOKUP(I97,Definitioner!$O$2:$S$381,3,FALSE)))","v":""},{"$f":"IF(A97<>\"\",VLOOKUP(A97,Definitioner!$A$2:$B$119,2),\"\")","v":""},null,{"$f":"IF(LEN(A97),LimitLookup($A97,Regelsæt,1),\"\")","v":""},{"$f":"IF(LEN(A97),LimitLookup($A97,Regelsæt,2),\"\")","v":""},{"$f":"IF(LEN(A97),LimitLookup($A97,Regelsæt,3),\"\")","v":""},{"$f":"IF(LEN(A97),LimitLookup($A97,Regelsæt,4),\"\")","v":""},{"$f":"IF(LEN(A97),LimitLookup($A97,Regelsæt,5),\"\")","v":""}]
[{"$f":"IF(I98=\"\",\"\",IF($A$3=\"ELIMS\",IF(ISNA(VLOOKUP(I98,Definitioner!$P$2:$S$381,2,FALSE)),\"\",VLOOKUP(I98,Definitioner!$P$2:$S$381,2,FALSE)),VLOOKUP(I98,Definitioner!$O$2:$S$381,3,FALSE)))","v":""},{"$f":"IF(A98<>\"\",VLOOKUP(A98,Definitioner!$A$2:$B$119,2),\"\")","v":""},null,{"$f":"IF(LEN(A98),LimitLookup($A98,Regelsæt,1),\"\")","v":""},{"$f":"IF(LEN(A98),LimitLookup($A98,Regelsæt,2),\"\")","v":""},{"$f":"IF(LEN(A98),LimitLookup($A98,Regelsæt,3),\"\")","v":""},{"$f":"IF(LEN(A98),LimitLookup($A98,Regelsæt,4),\"\")","v":""},{"$f":"IF(LEN(A98),LimitLookup($A98,Regelsæt,5),\"\")","v":""}]
[{"$f":"IF(I99=\"\",\"\",IF($A$3=\"ELIMS\",IF(ISNA(VLOOKUP(I99,Definitioner!$P$2:$S$381,2,FALSE)),\"\",VLOOKUP(I99,Definitioner!$P$2:$S$381,2,FALSE)),VLOOKUP(I99,Definitioner!$O$2:$S$381,3,FALSE)))","v":""},{"$f":"IF(A99<>\"\",VLOOKUP(A99,Definitioner!$A$2:$B$119,2),\"\")","v":""},null,{"$f":"IF(LEN(A99),LimitLookup($A99,Regelsæt,1),\"\")","v":""},{"$f":"IF(LEN(A99),LimitLookup($A99,Regelsæt,2),\"\")","v":""},{"$f":"IF(LEN(A99),LimitLookup($A99,Regelsæt,3),\"\")","v":""},{"$f":"IF(LEN(A99),LimitLookup($A99,Regelsæt,4),\"\")","v":""},{"$f":"IF(LEN(A99),LimitLookup($A99,Regelsæt,5),\"\")","v":""}]
[{"$f":"IF(I100=\"\",\"\",IF($A$3=\"ELIMS\",IF(ISNA(VLOOKUP(I100,Definitioner!$P$2:$S$381,2,FALSE)),\"\",VLOOKUP(I100,Definitioner!$P$2:$S$381,2,FALSE)),VLOOKUP(I100,Definitioner!$O$2:$S$381,3,FALSE)))","v":""},{"$f":"IF(A100<>\"\",VLOOKUP(A100,Definitioner!$A$2:$B$119,2),\"\")","v":""},null,{"$f":"IF(LEN(A100),LimitLookup($A100,Regelsæt,1),\"\")","v":""},{"$f":"IF(LEN(A100),LimitLookup($A100,Regelsæt,2),\"\")","v":""},{"$f":"IF(LEN(A100),LimitLookup($A100,Regelsæt,3),\"\")","v":""},{"$f":"IF(LEN(A100),LimitLookup($A100,Regelsæt,4),\"\")","v":""},{"$f":"IF(LEN(A100),LimitLookup($A100,Regelsæt,5),\"\")","v":""}]
[]
[null,"░ = Parameteren er IKKE medtaget i beregningen af kategorien."]
[null,"# = ingen af de indgående parametre i summen påvist"]
[null,"i.m. = ikke måleligt"]
[]
[]
[]
[]
[]
[]
[]
[]
[]
[]
[]
[null,"Udgave: 36-2024"]

{"sheet":"PrøverLodret","index":1,"n_rows":13,"n_cols":105,"rows_kept":13,"cut":false,"hidden":false,"merged":[[2,1,2,2]]}
[null,"Lodret"]
[null,2,{"$f":"PrøverVandret!C3","v":3},null,null,{"$f":"IF(F$4=0,\"\",IF(PrøverVandret!$A$3=\"ELIMS\",IF(ISNA(VLOOKUP(F$4,Definitioner!$P$2:$S$381,2,FALSE)),\"\",VLOOKUP(F$4,Definitioner!$P$2:$S$381,2,FALSE)),VLOOKUP(F$4,Definitioner!$O$2:$S$381,3,FALSE)))","v":""},{"$f":"IF(G$4=0,\"\",IF(PrøverVandret!$A$3=\"ELIMS\",IF(ISNA(VLOOKUP(G$4,Definitioner!$P$2:$S$381,2,FALSE)),\"\",VLOOKUP(G$4,Definitioner!$P$2:$S$381,2,FALSE)),VLOOKUP(G$4,Definitioner!$O$2:$S$381,3,FALSE)))","v":2},{"$f":"IF(H$4=0,\"\",IF(PrøverVandret!$A$3=\"ELIMS\",IF(ISNA(VLOOKUP(H$4,Definitioner!$P$2:$S$381,2,FALSE)),\"\",VLOOKUP(H$4,Definitioner!$P$2:$S$381,2,FALSE)),VLOOKUP(H$4,Definitioner!$O$2:$S$381,3,FALSE)))","v":3},{"$f":"IF(I$4=0,\"\",IF(PrøverVandret!$A$3=\"ELIMS\",IF(ISNA(VLOOKUP(I$4,Definitioner!$P$2:$S$381,2,FALSE)),\"\",VLOOKUP(I$4,Definitioner!$P$2:$S$381,2,FALSE)),VLOOKUP(I$4,Definitioner!$O$2:$S$381,3,FALSE)))","v":5},{"$f":"IF(J$4=0,\"\",IF(PrøverVandret!$A$3=\"ELIMS\",IF(ISNA(VLOOKUP(J$4,Definitioner!$P$2:$S$381,2,FALSE)),\"\",VLOOKUP(J$4,Definitioner!$P$2:$S$381,2,FALSE)),VLOOKUP(J$4,Definitioner!$O$2:$S$381,3,FALSE)))","v":6},{"$f":"IF(K$4=0,\"\",IF(PrøverVandret!$A$3=\"ELIMS\",IF(ISNA(VLOOKUP(K$4,Definitioner!$P$2:$S$381,2,FALSE)),\"\",VLOOKUP(K$4,Definitioner!$P$2:$S$381,2,FALSE)),VLOOKUP(K$4,Definitioner!$O$2:$S$381,3,FALSE)))","v":8},{"$f":"IF(L$4=0,\"\",IF(PrøverVandret!$A$3=\"ELIMS\",IF(ISNA(VLOOKUP(L$4,Definitioner!$P$2:$S$381,2,FALSE)),\"\",VLOOKUP(L$4,Definitioner!$P$2:$S$381,2,FALSE)),VLOOKUP(L$4,Definitioner!$O$2:$S$381,3,FALSE)))","v":10},{"$f":"IF(M$4=0,\"\",IF(PrøverVandret!$A$3=\"ELIMS\",IF(ISNA(VLOOKUP(M$4,Definitioner!$P$2:$S$381,2,FALSE)),\"\",VLOOKUP(M$4,Definitioner!$P$2:$S$381,2,FALSE)),VLOOKUP(M$4,Definitioner!$O$2:$S$381,3,FALSE)))","v":12},{"$f":"IF(N$4=0,\"\",IF(PrøverVandret!$A$3=\"ELIMS\",IF(ISNA(VLOOKUP(N$4,Definitioner!$P$2:$S$381,2,FALSE)),\"\",VLOOKUP(N$4,Definitioner!$P$2:$S$381,2,FALSE)),VLOOKUP(N$4,Definitioner!$O$2:$S$381,3,FALSE)))","v":50},{"$f":"IF(O$4=0,\"\",IF(PrøverVandret!$A$3=\"ELIMS\",IF(ISNA(VLOOKUP(O$4,Definitioner!$P$2:$S$381,2,FALSE)),\"\",VLOOKUP(O$4,Definitioner!$P$2:$S$381,2,FALSE)),VLOOKUP(O$4,Definitioner!$O$2:$S$381,3,FALSE)))","v":49},{"$f":"IF(P$4=0,\"\",IF(PrøverVandret!$A$3=\"ELIMS\",IF(ISNA(VLOOKUP(P$4,Definitioner!$P$2:$S$381,2,FALSE)),\"\",VLOOKUP(P$4,Definitioner!$P$2:$S$381,2,FALSE)),VLOOKUP(P$4,Definitioner!$O$2:$S$381,3,FALSE)))","v":48},{"$f":"IF(Q$4=0,\"\",IF(PrøverVandret!$A$3=\"ELIMS\",IF(ISNA(VLOOKUP(Q$4,Definitioner!$P$2:$S$381,2,FALSE)),\"\",VLOOKUP(Q$4,Definitioner!$P$2:$S$381,2,FALSE)),VLOOKUP(Q$4,Definitioner!$O$2:$S$381,3,FALSE)))","v":52},{"$f":"IF(R$4=0,\"\",IF(PrøverVandret!$A$3=\"ELIMS\",IF(ISNA(VLOOKUP(R$4,Definitioner!$P$2:$S$381,2,FALSE)),\"\",VLOOKUP(R$4,Definitioner!$P$2:$S$381,2,FALSE)),VLOOKUP(R$4,Definitioner!$O$2:$S$381,3,FALSE)))","v":11},{"$f":"IF(S$4=0,\"\",IF(PrøverVandret!$A$3=\"ELIMS\",IF(ISNA(VLOOKUP(S$4,Definitioner!$P$2:$S$381,2,FALSE)),\"\",VLOOKUP(S$4,Definitioner!$P$2:$S$381,2,FALSE)),VLOOKUP(S$4,Definitioner!$O$2:$S$381,3,FALSE)))","v":24},{"$f":"IF(T$4=0,\"\",IF(PrøverVandret!$A$3=\"ELIMS\",IF(ISNA(VLOOKUP(T$4,Definitioner!$P$2:$S$381,2,FALSE)),\"\",VLOOKUP(T$4,Definitioner!$P$2:$S$381,2,FALSE)),VLOOKUP(T$4,Definitioner!$O$2:$S$381,3,FALSE)))","v":25},{"$f":"IF(U$4=0,\"\",IF(PrøverVandret!$A$3=\"ELIMS\",IF(ISNA(VLOOKUP(U$4,Definitioner!$P$2:$S$381,2,FALSE)),\"\",VLOOKUP(U$4,Definitioner!$P$2:$S$381,2,FALSE)),VLOOKUP(U$4,Definitioner!$O$2:$S$381,3,FALSE)))","v":19},{"$f":"IF(V$4=0,\"\",IF(PrøverVandret!$A$3=\"ELIMS\",IF(ISNA(VLOOKUP(V$4,Definitioner!$P$2:$S$381,2,FALSE)),\"\",VLOOKUP(V$4,Definitioner!$P$2:$S$381,2,FALSE)),VLOOKUP(V$4,Definitioner!$O$2:$S$381,3,FALSE)))","v":26},{"$f":"IF(W$4=0,\"\",IF(PrøverVandret!$A$3=\"ELIMS\",IF(ISNA(VLOOKUP(W$4,Definitioner!$P$2:$S$381,2,FALSE)),\"\",VLOOKUP(W$4,Definitioner!$P$2:$S$381,2,FALSE)),VLOOKUP(W$4,Definitioner!$O$2:$S$381,3,FALSE)))","v":20},{"$f":"IF(X$4=0,\"\",IF(PrøverVandret!$A$3=\"ELIMS\",IF(ISNA(VLOOKUP(X$4,Definitioner!$P$2:$S$381,2,FALSE)),\"\",VLOOKUP(X$4,Definitioner!$P$2:$S$381,2,FALSE)),VLOOKUP(X$4,Definitioner!$O$2:$S$381,3,FALSE)))","v":18},{"$f":"IF(Y$4=0,\"\",IF(PrøverVandret!$A$3=\"ELIMS\",IF(ISNA(VLOOKUP(Y$4,Definitioner!$P$2:$S$381,2,FALSE)),\"\",VLOOKUP(Y$4,Definitioner!$P$2:$S$381,2,FALSE)),VLOOKUP(Y$4,Definitioner!$O$2:$S$381,3,FALSE)))","v":""},{"$f":"IF(Z$4=0,\"\",IF(PrøverVandret!$A$3=\"ELIMS\",IF(ISNA(VLOOKUP(Z$4,Definitioner!$P$2:$S$381,2,FALSE)),\"\",VLOOKUP(Z$4,Definitioner!$P$2:$S$381,2,FALSE)),VLOOKUP(Z$4,Definitioner!$O$2:$S$381,3,FALSE)))","v":""},{"$f":"IF(AA$4=0,\"\",IF(PrøverVandret!$A$3=\"ELIMS\",IF(ISNA(VLOOKUP(AA$4,Definitioner!$P$2:$S$381,2,FALSE)),\"\",VLOOKUP(AA$4,Definitioner!$P$2:$S$381,2,FALSE)),VLOOKUP(AA$4,Definitioner!$O$2:$S$381,3,FALSE)))","v":""},{"$f":"IF(AB$4=0,\"\",IF(PrøverVandret!$A$3=\"ELIMS\",IF(ISNA(VLOOKUP(AB$4,Definitioner!$P$2:$S$381,2,FALSE)),\"\",VLOOKUP(AB$4,Definitioner!$P$2:$S$381,2,FALSE)),VLOOKUP(AB$4,Definitioner!$O$2:$S$381,3,FALSE)))","v":""},{"$f":"IF(AC$4=0,\"\",IF(PrøverVandret!$A$3=\"ELIMS\",IF(ISNA(VLOOKUP(AC$4,Definitioner!$P$2:$S$381,2,FALSE)),\"\",VLOOKUP(AC$4,Definitioner!$P$2:$S$381,2,FALSE)),VLOOKUP(AC$4,Definitioner!$O$2:$S$381,3,FALSE)))","v":""},{"$f":"IF(AD$4=0,\"\",IF(PrøverVandret!$A$3=\"ELIMS\",IF(ISNA(VLOOKUP(AD$4,Definitioner!$P$2:$S$381,2,FALSE)),\"\",VLOOKUP(AD$4,Definitioner!$P$2:$S$381,2,FALSE)),VLOOKUP(AD$4,Definitioner!$O$2:$S$381,3,FALSE)))","v":""},{"$f":"IF(AE$4=0,\"\",IF(PrøverVandret!$A$3=\"ELIMS\",IF(ISNA(VLOOKUP(AE$4,Definitioner!$P$2:$S$381,2,FALSE)),\"\",VLOOKUP(AE$4,Definitioner!$P$2:$S$381,2,FALSE)),VLOOKUP(AE$4,Definitioner!$O$2:$S$381,3,FALSE)))","v":""},{"$f":"IF(AF$4=0,\"\",IF(PrøverVandret!$A$3=\"ELIMS\",IF(ISNA(VLOOKUP(AF$4,Definitioner!$P$2:$S$381,2,FALSE)),\"\",VLOOKUP(AF$4,Definitioner!$P$2:$S$381,2,FALSE)),VLOOKUP(AF$4,Definitioner!$O$2:$S$381,3,FALSE)))","v":""},{"$f":"IF(AG$4=0,\"\",IF(PrøverVandret!$A$3=\"ELIMS\",IF(ISNA(VLOOKUP(AG$4,Definitioner!$P$2:$S$381,2,FALSE)),\"\",VLOOKUP(AG$4,Definitioner!$P$2:$S$381,2,FALSE)),VLOOKUP(AG$4,Definitioner!$O$2:$S$381,3,FALSE)))","v":""},{"$f":"IF(AH$4=0,\"\",IF(PrøverVandret!$A$3=\"ELIMS\",IF(ISNA(VLOOKUP(AH$4,Definitioner!$P$2:$S$381,2,FALSE)),\"\",VLOOKUP(AH$4,Definitioner!$P$2:$S$381,2,FALSE)),VLOOKUP(AH$4,Definitioner!$O$2:$S$381,3,FALSE)))","v":""},{"$f":"IF(AI$4=0,\"\",IF(PrøverVandret!$A$3=\"ELIMS\",IF(ISNA(VLOOKUP(AI$4,Definitioner!$P$2:$S$381,2,FALSE)),\"\",VLOOKUP(AI$4,Definitioner!$P$2:$S$381,2,FALSE)),VLOOKUP(AI$4,Definitioner!$O$2:$S$381,3,FALSE)))","v":""},{"$f":"IF(AJ$4=0,\"\",IF(PrøverVandret!$A$3=\"ELIMS\",IF(ISNA(VLOOKUP(AJ$4,Definitioner!$P$2:$S$381,2,FALSE)),\"\",VLOOKUP(AJ$4,Definitioner!$P$2:$S$381,2,FALSE)),VLOOKUP(AJ$4,Definitioner!$O$2:$S$381,3,FALSE)))","v":""},{"$f":"IF(AK$4=0,\"\",IF(PrøverVandret!$A$3=\"ELIMS\",IF(ISNA(VLOOKUP(AK$4,Definitioner!$P$2:$S$381,2,FALSE)),\"\",VLOOKUP(AK$4,Definitioner!$P$2:$S$381,2,FALSE)),VLOOKUP(AK$4,Definitioner!$O$2:$S$381,3,FALSE)))","v":""},{"$f":"IF(AL$4=0,\"\",IF(PrøverVandret!$A$3=\"ELIMS\",IF(ISNA(VLOOKUP(AL$4,Definitioner!$P$2:$S$381,2,FALSE)),\"\",VLOOKUP(AL$4,Definitioner!$P$2:$S$381,2,FALSE)),VLOOKUP(AL$4,Definitioner!$O$2:$S$381,3,FALSE)))","v":""},{"$f":"IF(AM$4=0,\"\",IF(PrøverVandret!$A$3=\"ELIMS\",IF(ISNA(VLOOKUP(AM$4,Definitioner!$P$2:$S$381,2,FALSE)),\"\",VLOOKUP(AM$4,Definitioner!$P$2:$S$381,2,FALSE)),VLOOKUP(AM$4,Definitioner!$O$2:$S$381,3,FALSE)))","v":""},{"$f":"IF(AN$4=0,\"\",IF(PrøverVandret!$A$3=\"ELIMS\",IF(ISNA(VLOOKUP(AN$4,Definitioner!$P$2:$S$381,2,FALSE)),\"\",VLOOKUP(AN$4,Definitioner!$P$2:$S$381,2,FALSE)),VLOOKUP(AN$4,Definitioner!$O$2:$S$381,3,FALSE)))","v":""},{"$f":"IF(AO$4=0,\"\",IF(PrøverVandret!$A$3=\"ELIMS\",IF(ISNA(VLOOKUP(AO$4,Definitioner!$P$2:$S$381,2,FALSE)),\"\",VLOOKUP(AO$4,Definitioner!$P$2:$S$381,2,FALSE)),VLOOKUP(AO$4,Definitioner!$O$2:$S$381,3,FALSE)))","v":""},{"$f":"IF(AP$4=0,\"\",IF(PrøverVandret!$A$3=\"ELIMS\",IF(ISNA(VLOOKUP(AP$4,Definitioner!$P$2:$S$381,2,FALSE)),\"\",VLOOKUP(AP$4,Definitioner!$P$2:$S$381,2,FALSE)),VLOOKUP(AP$4,Definitioner!$O$2:$S$381,3,FALSE)))","v":""},{"$f":"IF(AQ$4=0,\"\",IF(PrøverVandret!$A$3=\"ELIMS\",IF(ISNA(VLOOKUP(AQ$4,Definitioner!$P$2:$S$381,2,FALSE)),\"\",VLOOKUP(AQ$4,Definitioner!$P$2:$S$381,2,FALSE)),VLOOKUP(AQ$4,Definitioner!$O$2:$S$381,3,FALSE)))","v":""},{"$f":"IF(AR$4=0,\"\",IF(PrøverVandret!$A$3=\"ELIMS\",IF(ISNA(VLOOKUP(AR$4,Definitioner!$P$2:$S$381,2,FALSE)),\"\",VLOOKUP(AR$4,Definitioner!$P$2:$S$381,2,FALSE)),VLOOKUP(AR$4,Definitioner!$O$2:$S$381,3,FALSE)))","v":""},{"$f":"IF(AS$4=0,\"\",IF(PrøverVandret!$A$3=\"ELIMS\",IF(ISNA(VLOOKUP(AS$4,Definitioner!$P$2:$S$381,2,FALSE)),\"\",VLOOKUP(AS$4,Definitioner!$P$2:$S$381,2,FALSE)),VLOOKUP(AS$4,Definitioner!$O$2:$S$381,3,FALSE)))","v":""},{"$f":"IF(AT$4=0,\"\",IF(PrøverVandret!$A$3=\"ELIMS\",IF(ISNA(VLOOKUP(AT$4,Definitioner!$P$2:$S$381,2,FALSE)),\"\",VLOOKUP(AT$4,Definitioner!$P$2:$S$381,2,FALSE)),VLOOKUP(AT$4,Definitioner!$O$2:$S$381,3,FALSE)))","v":""},{"$f":"IF(AU$4=0,\"\",IF(PrøverVandret!$A$3=\"ELIMS\",IF(ISNA(VLOOKUP(AU$4,Definitioner!$P$2:$S$381,2,FALSE)),\"\",VLOOKUP(AU$4,Definitioner!$P$2:$S$381,2,FALSE)),VLOOKUP(AU$4,Definitioner!$O$2:$S$381,3,FALSE)))","v":""},{"$f":"IF(AV$4=0,\"\",IF(PrøverVandret!$A$3=\"ELIMS\",IF(ISNA(VLOOKUP(AV$4,Definitioner!$P$2:$S$381,2,FALSE)),\"\",VLOOKUP(AV$4,Definitioner!$P$2:$S$381,2,FALSE)),VLOOKUP(AV$4,Definitioner!$O$2:$S$381,3,FALSE)))","v":""},{"$f":"IF(AW$4=0,\"\",IF(PrøverVandret!$A$3=\"ELIMS\",IF(ISNA(VLOOKUP(AW$4,Definitioner!$P$2:$S$381,2,FALSE)),\"\",VLOOKUP(AW$4,Definitioner!$P$2:$S$381,2,FALSE)),VLOOKUP(AW$4,Definitioner!$O$2:$S$381,3,FALSE)))","v":""},{"$f":"IF(AX$4=0,\"\",IF(PrøverVandret!$A$3=\"ELIMS\",IF(ISNA(VLOOKUP(AX$4,Definitioner!$P$2:$S$381,2,FALSE)),\"\",VLOOKUP(AX$4,Definitioner!$P$2:$S$381,2,FALSE)),VLOOKUP(AX$4,Definitioner!$O$2:$S$381,3,FALSE)))","v":""},{"$f":"IF(AY$4=0,\"\",IF(PrøverVandret!$A$3=\"ELIMS\",IF(ISNA(VLOOKUP(AY$4,Definitioner!$P$2:$S$381,2,FALSE)),\"\",VLOOKUP(AY$4,Definitioner!$P$2:$S$381,2,FALSE)),VLOOKUP(AY$4,Definitioner!$O$2:$S$381,3,FALSE)))","v":""},{"$f":"IF(AZ$4=0,\"\",IF(PrøverVandret!$A$3=\"ELIMS\",IF(ISNA(VLOOKUP(AZ$4,Definitioner!$P$2:$S$381,2,FALSE)),\"\",VLOOKUP(AZ$4,Definitioner!$P$2:$S$381,2,FALSE)),VLOOKUP(AZ$4,Definitioner!$O$2:$S$381,3,FALSE)))","v":""},{"$f":"IF(BA$4=0,\"\",IF(PrøverVandret!$A$3=\"ELIMS\",IF(ISNA(VLOOKUP(BA$4,Definitioner!$P$2:$S$381,2,FALSE)),\"\",VLOOKUP(BA$4,Definitioner!$P$2:$S$381,2,FALSE)),VLOOKUP(BA$4,Definitioner!$O$2:$S$381,3,FALSE)))","v":""},{"$f":"IF(BB$4=0,\"\",IF(PrøverVandret!$A$3=\"ELIMS\",IF(ISNA(VLOOKUP(BB$4,Definitioner!$P$2:$S$381,2,FALSE)),\"\",VLOOKUP(BB$4,Definitioner!$P$2:$S$381,2,FALSE)),VLOOKUP(BB$4,Definitioner!$O$2:$S$381,3,FALSE)))","v":""},{"$f":"IF(BC$4=0,\"\",IF(PrøverVandret!$A$3=\"ELIMS\",IF(ISNA(VLOOKUP(BC$4,Definitioner!$P$2:$S$381,2,FALSE)),\"\",VLOOKUP(BC$4,Definitioner!$P$2:$S$381,2,FALSE)),VLOOKUP(BC$4,Definitioner!$O$2:$S$381,3,FALSE)))","v":""},{"$f":"IF(BD$4=0,\"\",IF(PrøverVandret!$A$3=\"ELIMS\",IF(ISNA(VLOOKUP(BD$4,Definitioner!$P$2:$S$381,2,FALSE)),\"\",VLOOKUP(BD$4,Definitioner!$P$2:$S$381,2,FALSE)),VLOOKUP(BD$4,Definitioner!$O$2:$S$381,3,FALSE)))","v":""},{"$f":"IF(BE$4=0,\"\",IF(PrøverVandret!$A$3=\"ELIMS\",IF(ISNA(VLOOKUP(BE$4,Definitioner!$P$2:$S$381,2,FALSE)),\"\",VLOOKUP(BE$4,Definitioner!$P$2:$S$381,2,FALSE)),VLOOKUP(BE$4,Definitioner!$O$2:$S$381,3,FALSE)))","v":""},{"$f":"IF(BF$4=0,\"\",IF(PrøverVandret!$A$3=\"ELIMS\",IF(ISNA(VLOOKUP(BF$4,Definitioner!$P$2:$S$381,2,FALSE)),\"\",VLOOKUP(BF$4,Definitioner!$P$2:$S$381,2,FALSE)),VLOOKUP(BF$4,Definitioner!$O$2:$S$381,3,FALSE)))","v":""},{"$f":"IF(BG$4=0,\"\",IF(PrøverVandret!$A$3=\"ELIMS\",IF(ISNA(VLOOKUP(BG$4,Definitioner!$P$2:$S$381,2,FALSE)),\"\",VLOOKUP(BG$4,Definitioner!$P$2:$S$381,2,FALSE)),VLOOKUP(BG$4,Definitioner!$O$2:$S$381,3,FALSE)))","v":""},{"$f":"IF(BH$4=0,\"\",IF(PrøverVandret!$A$3=\"ELIMS\",IF(ISNA(VLOOKUP(BH$4,Definitioner!$P$2:$S$381,2,FALSE)),\"\",VLOOKUP(BH$4,Definitioner!$P$2:$S$381,2,FALSE)),VLOOKUP(BH$4,Definitioner!$O$2:$S$381,3,FALSE)))","v":""},{"$f":"IF(BI$4=0,\"\",IF(PrøverVandret!$A$3=\"ELIMS\",IF(ISNA(VLOOKUP(BI$4,Definitioner!$P$2:$S$381,2,FALSE)),\"\",VLOOKUP(BI$4,Definitioner!$P$2:$S$381,2,FALSE)),VLOOKUP(BI$4,Definitioner!$O$2:$S$381,3,FALSE)))","v":""},{"$f":"IF(BJ$4=0,\"\",IF(PrøverVandret!$A$3=\"ELIMS\",IF(ISNA(VLOOKUP(BJ$4,Definitioner!$P$2:$S$381,2,FALSE)),\"\",VLOOKUP(BJ$4,Definitioner!$P$2:$S$381,2,FALSE)),VLOOKUP(BJ$4,Definitioner!$O$2:$S$381,3,FALSE)))","v":""},{"$f":"IF(BK$4=0,\"\",IF(PrøverVandret!$A$3=\"ELIMS\",IF(ISNA(VLOOKUP(BK$4,Definitioner!$P$2:$S$381,2,FALSE)),\"\",VLOOKUP(BK$4,Definitioner!$P$2:$S$381,2,FALSE)),VLOOKUP(BK$4,Definitioner!$O$2:$S$381,3,FALSE)))","v":""},{"$f":"IF(BL$4=0,\"\",IF(PrøverVandret!$A$3=\"ELIMS\",IF(ISNA(VLOOKUP(BL$4,Definitioner!$P$2:$S$381,2,FALSE)),\"\",VLOOKUP(BL$4,Definitioner!$P$2:$S$381,2,FALSE)),VLOOKUP(BL$4,Definitioner!$O$2:$S$381,3,FALSE)))","v":""},{"$f":"IF(BM$4=0,\"\",IF(PrøverVandret!$A$3=\"ELIMS\",IF(ISNA(VLOOKUP(BM$4,Definitioner!$P$2:$S$381,2,FALSE)),\"\",VLOOKUP(BM$4,Definitioner!$P$2:$S$381,2,FALSE)),VLOOKUP(BM$4,Definitioner!$O$2:$S$381,3,FALSE)))","v":""},{"$f":"IF(BN$4=0,\"\",IF(PrøverVandret!$A$3=\"ELIMS\",IF(ISNA(VLOOKUP(BN$4,Definitioner!$P$2:$S$381,2,FALSE)),\"\",VLOOKUP(BN$4,Definitioner!$P$2:$S$381,2,FALSE)),VLOOKUP(BN$4,Definitioner!$O$2:$S$381,3,FALSE)))","v":""},{"$f":"IF(BO$4=0,\"\",IF(PrøverVandret!$A$3=\"ELIMS\",IF(ISNA(VLOOKUP(BO$4,Definitioner!$P$2:$S$381,2,FALSE)),\"\",VLOOKUP(BO$4,Definitioner!$P$2:$S$381,2,FALSE)),VLOOKUP(BO$4,Definitioner!$O$2:$S$381,3,FALSE)))","v":""},{"$f":"IF(BP$4=0,\"\",IF(PrøverVandret!$A$3=\"ELIMS\",IF(ISNA(VLOOKUP(BP$4,Definitioner!$P$2:$S$381,2,FALSE)),\"\",VLOOKUP(BP$4,Definitioner!$P$2:$S$381,2,FALSE)),VLOOKUP(BP$4,Definitioner!$O$2:$S$381,3,FALSE)))","v":""},{"$f":"IF(BQ$4=0,\"\",IF(PrøverVandret!$A$3=\"ELIMS\",IF(ISNA(VLOOKUP(BQ$4,Definitioner!$P$2:$S$381,2,FALSE)),\"\",VLOOKUP(BQ$4,Definitioner!$P$2:$S$381,2,FALSE)),VLOOKUP(BQ$4,Definitioner!$O$2:$S$381,3,FALSE)))","v":""},{"$f":"IF(BR$4=0,\"\",IF(PrøverVandret!$A$3=\"ELIMS\",IF(ISNA(VLOOKUP(BR$4,Definitioner!$P$2:$S$381,2,FALSE)),\"\",VLOOKUP(BR$4,Definitioner!$P$2:$S$381,2,FALSE)),VLOOKUP(BR$4,Definitioner!$O$2:$S$381,3,FALSE)))","v":""},{"$f":"IF(BS$4=0,\"\",IF(PrøverVandret!$A$3=\"ELIMS\",IF(ISNA(VLOOKUP(BS$4,Definitioner!$P$2:$S$381,2,FALSE)),\"\",VLOOKUP(BS$4,Definitioner!$P$2:$S$381,2,FALSE)),VLOOKUP(BS$4,Definitioner!$O$2:$S$381,3,FALSE)))","v":""},{"$f":"IF(BT$4=0,\"\",IF(PrøverVandret!$A$3=\"ELIMS\",IF(ISNA(VLOOKUP(BT$4,Definitioner!$P$2:$S$381,2,FALSE)),\"\",VLOOKUP(BT$4,Definitioner!$P$2:$S$381,2,FALSE)),VLOOKUP(BT$4,Definitioner!$O$2:$S$381,3,FALSE)))","v":""},{"$f":"IF(BU$4=0,\"\",IF(PrøverVandret!$A$3=\"ELIMS\",IF(ISNA(VLOOKUP(BU$4,Definitioner!$P$2:$S$381,2,FALSE)),\"\",VLOOKUP(BU$4,Definitioner!$P$2:$S$381,2,FALSE)),VLOOKUP(BU$4,Definitioner!$O$2:$S$381,3,FALSE)))","v":""},{"$f":"IF(BV$4=0,\"\",IF(PrøverVandret!$A$3=\"ELIMS\",IF(ISNA(VLOOKUP(BV$4,Definitioner!$P$2:$S$381,2,FALSE)),\"\",VLOOKUP(BV$4,Definitioner!$P$2:$S$381,2,FALSE)),VLOOKUP(BV$4,Definitioner!$O$2:$S$381,3,FALSE)))","v":""},{"$f":"IF(BW$4=0,\"\",IF(PrøverVandret!$A$3=\"ELIMS\",IF(ISNA(VLOOKUP(BW$4,Definitioner!$P$2:$S$381,2,FALSE)),\"\",VLOOKUP(BW$4,Definitioner!$P$2:$S$381,2,FALSE)),VLOOKUP(BW$4,Definitioner!$O$2:$S$381,3,FALSE)))","v":""},{"$f":"IF(BX$4=0,\"\",IF(PrøverVandret!$A$3=\"ELIMS\",IF(ISNA(VLOOKUP(BX$4,Definitioner!$P$2:$S$381,2,FALSE)),\"\",VLOOKUP(BX$4,Definitioner!$P$2:$S$381,2,FALSE)),VLOOKUP(BX$4,Definitioner!$O$2:$S$381,3,FALSE)))","v":""},{"$f":"IF(BY$4=0,\"\",IF(PrøverVandret!$A$3=\"ELIMS\",IF(ISNA(VLOOKUP(BY$4,Definitioner!$P$2:$S$381,2,FALSE)),\"\",VLOOKUP(BY$4,Definitioner!$P$2:$S$381,2,FALSE)),VLOOKUP(BY$4,Definitioner!$O$2:$S$381,3,FALSE)))","v":""},{"$f":"IF(BZ$4=0,\"\",IF(PrøverVandret!$A$3=\"ELIMS\",IF(ISNA(VLOOKUP(BZ$4,Definitioner!$P$2:$S$381,2,FALSE)),\"\",VLOOKUP(BZ$4,Definitioner!$P$2:$S$381,2,FALSE)),VLOOKUP(BZ$4,Definitioner!$O$2:$S$381,3,FALSE)))","v":""},{"$f":"IF(CA$4=0,\"\",IF(PrøverVandret!$A$3=\"ELIMS\",IF(ISNA(VLOOKUP(CA$4,Definitioner!$P$2:$S$381,2,FALSE)),\"\",VLOOKUP(CA$4,Definitioner!$P$2:$S$381,2,FALSE)),VLOOKUP(CA$4,Definitioner!$O$2:$S$381,3,FALSE)))","v":""},{"$f":"IF(CB$4=0,\"\",IF(PrøverVandret!$A$3=\"ELIMS\",IF(ISNA(VLOOKUP(CB$4,Definitioner!$P$2:$S$381,2,FALSE)),\"\",VLOOKUP(CB$4,Definitioner!$P$2:$S$381,2,FALSE)),VLOOKUP(CB$4,Definitioner!$O$2:$S$381,3,FALSE)))","v":""},{"$f":"IF(CC$4=0,\"\",IF(PrøverVandret!$A$3=\"ELIMS\",IF(ISNA(VLOOKUP(CC$4,Definitioner!$P$2:$S$381,2,FALSE)),\"\",VLOOKUP(CC$4,Definitioner!$P$2:$S$381,2,FALSE)),VLOOKUP(CC$4,Definitioner!$O$2:$S$381,3,FALSE)))","v":""},{"$f":"IF(CD$4=0,\"\",IF(PrøverVandret!$A$3=\"ELIMS\",IF(ISNA(VLOOKUP(CD$4,Definitioner!$P$2:$S$381,2,FALSE)),\"\",VLOOKUP(CD$4,Definitioner!$P$2:$S$381,2,FALSE)),VLOOKUP(CD$4,Definitioner!$O$2:$S$381,3,FALSE)))","v":""},{"$f":"IF(CE$4=0,\"\",IF(PrøverVandret!$A$3=\"ELIMS\",IF(ISNA(VLOOKUP(CE$4,Definitioner!$P$2:$S$381,2,FALSE)),\"\",VLOOKUP(CE$4,Definitioner!$P$2:$S$381,2,FALSE)),VLOOKUP(CE$4,Definitioner!$O$2:$S$381,3,FALSE)))","v":""},{"$f":"IF(CF$4=0,\"\",IF(PrøverVandret!$A$3=\"ELIMS\",IF(ISNA(VLOOKUP(CF$4,Definitioner!$P$2:$S$381,2,FALSE)),\"\",VLOOKUP(CF$4,Definitioner!$P$2:$S$381,2,FALSE)),VLOOKUP(CF$4,Definitioner!$O$2:$S$381,3,FALSE)))","v":""},{"$f":"IF(CG$4=0,\"\",IF(PrøverVandret!$A$3=\"ELIMS\",IF(ISNA(VLOOKUP(CG$4,Definitioner!$P$2:$S$381,2,FALSE)),\"\",VLOOKUP(CG$4,Definitioner!$P$2:$S$381,2,FALSE)),VLOOKUP(CG$4,Definitioner!$O$2:$S$381,3,FALSE)))","v":""},{"$f":"IF(CH$4=0,\"\",IF(PrøverVandret!$A$3=\"ELIMS\",IF(ISNA(VLOOKUP(CH$4,Definitioner!$P$2:$S$381,2,FALSE)),\"\",VLOOKUP(CH$4,Definitioner!$P$2:$S$381,2,FALSE)),VLOOKUP(CH$4,Definitioner!$O$2:$S$381,3,FALSE)))","v":""},{"$f":"IF(CI$4=0,\"\",IF(PrøverVandret!$A$3=\"ELIMS\",IF(ISNA(VLOOKUP(CI$4,Definitioner!$P$2:$S$381,2,FALSE)),\"\",VLOOKUP(CI$4,Definitioner!$P$2:$S$381,2,FALSE)),VLOOKUP(CI$4,Definitioner!$O$2:$S$381,3,FALSE)))","v":""},{"$f":"IF(CJ$4=0,\"\",IF(PrøverVandret!$A$3=\"ELIMS\",IF(ISNA(VLOOKUP(CJ$4,Definitioner!$P$2:$S$381,2,FALSE)),\"\",VLOOKUP(CJ$4,Definitioner!$P$2:$S$381,2,FALSE)),VLOOKUP(CJ$4,Definitioner!$O$2:$S$381,3,FALSE)))","v":""},{"$f":"IF(CK$4=0,\"\",IF(PrøverVandret!$A$3=\"ELIMS\",IF(ISNA(VLOOKUP(CK$4,Definitioner!$P$2:$S$381,2,FALSE)),\"\",VLOOKUP(CK$4,Definitioner!$P$2:$S$381,2,FALSE)),VLOOKUP(CK$4,Definitioner!$O$2:$S$381,3,FALSE)))","v":""},{"$f":"IF(CL$4=0,\"\",IF(PrøverVandret!$A$3=\"ELIMS\",IF(ISNA(VLOOKUP(CL$4,Definitioner!$P$2:$S$381,2,FALSE)),\"\",VLOOKUP(CL$4,Definitioner!$P$2:$S$381,2,FALSE)),VLOOKUP(CL$4,Definitioner!$O$2:$S$381,3,FALSE)))","v":""},{"$f":"IF(CM$4=0,\"\",IF(PrøverVandret!$A$3=\"ELIMS\",IF(ISNA(VLOOKUP(CM$4,Definitioner!$P$2:$S$381,2,FALSE)),\"\",VLOOKUP(CM$4,Definitioner!$P$2:$S$381,2,FALSE)),VLOOKUP(CM$4,Definitioner!$O$2:$S$381,3,FALSE)))","v":""},{"$f":"IF(CN$4=0,\"\",IF(PrøverVandret!$A$3=\"ELIMS\",IF(ISNA(VLOOKUP(CN$4,Definitioner!$P$2:$S$381,2,FALSE)),\"\",VLOOKUP(CN$4,Definitioner!$P$2:$S$381,2,FALSE)),VLOOKUP(CN$4,Definitioner!$O$2:$S$381,3,FALSE)))","v":""},{"$f":"IF(CO$4=0,\"\",IF(PrøverVandret!$A$3=\"ELIMS\",IF(ISNA(VLOOKUP(CO$4,Definitioner!$P$2:$S$381,2,FALSE)),\"\",VLOOKUP(CO$4,Definitioner!$P$2:$S$381,2,FALSE)),VLOOKUP(CO$4,Definitioner!$O$2:$S$381,3,FALSE)))","v":""},{"$f":"IF(CP$4=0,\"\",IF(PrøverVandret!$A$3=\"ELIMS\",IF(ISNA(VLOOKUP(CP$4,Definitioner!$P$2:$S$381,2,FALSE)),\"\",VLOOKUP(CP$4,Definitioner!$P$2:$S$381,2,FALSE)),VLOOKUP(CP$4,Definitioner!$O$2:$S$381,3,FALSE)))","v":""},{"$f":"IF(CQ$4=0,\"\",IF(PrøverVandret!$A$3=\"ELIMS\",IF(ISNA(VLOOKUP(CQ$4,Definitioner!$P$2:$S$381,2,FALSE)),\"\",VLOOKUP(CQ$4,Definitioner!$P$2:$S$381,2,FALSE)),VLOOKUP(CQ$4,Definitioner!$O$2:$S$381,3,FALSE)))","v":""},{"$f":"IF(CR$4=0,\"\",IF(PrøverVandret!$A$3=\"ELIMS\",IF(ISNA(VLOOKUP(CR$4,Definitioner!$P$2:$S$381,2,FALSE)),\"\",VLOOKUP(CR$4,Definitioner!$P$2:$S$381,2,FALSE)),VLOOKUP(CR$4,Definitioner!$O$2:$S$381,3,FALSE)))","v":""},{"$f":"IF(CS$4=0,\"\",IF(PrøverVandret!$A$3=\"ELIMS\",IF(ISNA(VLOOKUP(CS$4,Definitioner!$P$2:$S$381,2,FALSE)),\"\",VLOOKUP(CS$4,Definitioner!$P$2:$S$381,2,FALSE)),VLOOKUP(CS$4,Definitioner!$O$2:$S$381,3,FALSE)))","v":""},{"$f":"IF(CT$4=0,\"\",IF(PrøverVandret!$A$3=\"ELIMS\",IF(ISNA(VLOOKUP(CT$4,Definitioner!$P$2:$S$381,2,FALSE)),\"\",VLOOKUP(CT$4,Definitioner!$P$2:$S$381,2,FALSE)),VLOOKUP(CT$4,Definitioner!$O$2:$S$381,3,FALSE)))","v":""},{"$f":"IF(CU$4=0,\"\",IF(PrøverVandret!$A$3=\"ELIMS\",IF(ISNA(VLOOKUP(CU$4,Definitioner!$P$2:$S$381,2,FALSE)),\"\",VLOOKUP(CU$4,Definitioner!$P$2:$S$381,2,FALSE)),VLOOKUP(CU$4,Definitioner!$O$2:$S$381,3,FALSE)))","v":""},{"$f":"IF(CV$4=0,\"\",IF(PrøverVandret!$A$3=\"ELIMS\",IF(ISNA(VLOOKUP(CV$4,Definitioner!$P$2:$S$381,2,FALSE)),\"\",VLOOKUP(CV$4,Definitioner!$P$2:$S$381,2,FALSE)),VLOOKUP(CV$4,Definitioner!$O$2:$S$381,3,FALSE)))","v":""},{"$f":"IF(CW$4=0,\"\",IF(PrøverVandret!$A$3=\"ELIMS\",IF(ISNA(VLOOKUP(CW$4,Definitioner!$P$2:$S$381,2,FALSE)),\"\",VLOOKUP(CW$4,Definitioner!$P$2:$S$381,2,FALSE)),VLOOKUP(CW$4,Definitioner!$O$2:$S$381,3,FALSE)))","v":""}]
[null,{"$f":"ProjectData","v":"Kallerup Grusgrav , -, Muldjord"},null,null,"Parameter  ►",{"$f":"TRANSPOSE(PrøverVandret!B5:B100)","v":"Tørstof"},"Bly (Pb)","Cadmium (Cd)","Chrom (Cr)","Kobber (Cu)","Nikkel (Ni)","Zink (Zn)","C6H6-C10","C10-C15","C15-C20","C20-C35","Sum (C10-C20)","Sum (C6H6-C35)","Fluoranthen","Benzo(b+j+k)fluoranthen","Benzo(a)pyren","Indeno(1,2,3-cd)pyren ","Dibenz(a,h)anthracen","Sum af 7 PAH'er","","","","","","","","","","","","","","","","","","","","","","","","","","","","","","","","","","","","","","","","","","","","","","","","","","","","","","","","","","","","","","","","","","","","","","","","","","","","",""]
[null,null,null,null,null,{"$f":"TRANSPOSE(PrøverVandret!I5:I100)","v":"VL142|F001F129"},"VLBD5|7003A003","VLBC5|7003A016","VLBD0|7003A005","VLBA2|7001A010","VLBD7|7003A007","VLB6T|7001A013","VL309|MC000007","VL309|CA001572","VL309|CA001573","VL309|CA00159R","VL309|CA0015CV","VL309|MC000004","VL04J|7300A359","VL04N|GF00005X","VL04C|7300A035","VL04K|7300A365","VL04I|7300A366","VL04B|CA001440",0,0,0,0,0,0,0,0,0,0,0,0,0,0,0,0,0,0,0,0,0,0,0,0,0,0,0,0,0,0,0,0,0,0,0,0,0,0,0,0,0,0,0,0,0,0,0,0,0,0,0,0,0,0,0,0,0,0,0,0,0,0,0,0,0,0,0,0,0,0,0,0,0,0,0,0,0]
[null,null,null,null,"Enhed",{"$f":"TRANSPOSE(PrøverVandret!C5:C100)","v":"%"},"mg/kg ts.","mg/kg ts.","mg/kg ts.","mg/kg ts.","mg/kg ts.","mg/kg ts.","mg/kg ts.","mg/kg ts.","mg/kg ts.","mg/kg ts.","mg/kg ts.","mg/kg ts.","mg/kg ts.","mg/kg ts.","mg/kg ts.","mg/kg ts.","mg/kg ts.","mg/kg ts.",0,0,0,0,0,0,0,0,0,0,0,0,0,0,0,0,0,0,0,0,0,0,0,0,0,0,0,0,0,0,0,0,0,0,0,0,0,0,0,0,0,0,0,0,0,0,0,0,0,0,0,0,0,0,0,0,0,0,0,0,0,0,0,0,0,0,0,0,0,0,0,0,0,0,0,0,0]
[null,{"$f":"PrøverVandret!C3","v":3},null,{"$f":"TRANSPOSE(PrøverVandret!D4:H4)","v":"Kategori 1"},{"$f":"TRANSPOSE(PrøverVandret!D3:H3)","v":"<="},{"$f":"IF(F$2<>\"\",LimitLookup(F$2,PrøverVandret!Regelsæt,1),\"\")","v":""},{"$f":"IF(G$2<>\"\",LimitLookup(G$2,PrøverVandret!Regelsæt,1),\"\")","v":"40"},{"$f":"IF(H$2<>\"\",LimitLookup(H$2,PrøverVandret!Regelsæt,1),\"\")","v":"0,5"},{"$f":"IF(I$2<>\"\",LimitLookup(I$2,PrøverVandret!Regelsæt,1),\"\")","v":"500"},{"$f":"IF(J$2<>\"\",LimitLookup(J$2,PrøverVandret!Regelsæt,1),\"\")","v":"500"},{"$f":"IF(K$2<>\"\",LimitLookup(K$2,PrøverVandret!Regelsæt,1),\"\")","v":"30"},{"$f":"IF(L$2<>\"\",LimitLookup(L$2,PrøverVandret!Regelsæt,1),\"\")","v":"500"},{"$f":"IF(M$2<>\"\",LimitLookup(M$2,PrøverVandret!Regelsæt,1),\"\")","v":"25"},{"$f":"IF(N$2<>\"\",LimitLookup(N$2,PrøverVandret!Regelsæt,1),\"\")","v":"40"},{"$f":"IF(O$2<>\"\",LimitLookup(O$2,PrøverVandret!Regelsæt,1),\"\")","v":"55"},{"$f":"IF(P$2<>\"\",LimitLookup(P$2,PrøverVandret!Regelsæt,1),\"\")","v":"100"},{"$f":"IF(Q$2<>\"\",LimitLookup(Q$2,PrøverVandret!Regelsæt,1),\"\")","v":"-"},{"$f":"IF(R$2<>\"\",LimitLookup(R$2,PrøverVandret!Regelsæt,1),\"\")","v":"100"},{"$f":"IF(S$2<>\"\",LimitLookup(S$2,PrøverVandret!Regelsæt,1),\"\")","v":"-"},{"$f":"IF(T$2<>\"\",LimitLookup(T$2,PrøverVandret!Regelsæt,1),\"\")","v":"-"},{"$f":"IF(U$2<>\"\",LimitLookup(U$2,PrøverVandret!Regelsæt,1),\"\")","v":"0,3"},{"$f":"IF(V$2<>\"\",LimitLookup(V$2,PrøverVandret!Regelsæt,1),\"\")","v":"-"},{"$f":"IF(W$2<>\"\",LimitLookup(W$2,PrøverVandret!Regelsæt,1),\"\")","v":"0,3"},{"$f":"IF(X$2<>\"\",LimitLookup(X$2,PrøverVandret!Regelsæt,1),\"\")","v":"4"},{"$f":"IF(Y$2<>\"\",LimitLookup(Y$2,PrøverVandret!Regelsæt,1),\"\")","v":""},{"$f":"IF(Z$2<>\"\",LimitLookup(Z$2,PrøverVandret!Regelsæt,1),\"\")","v":""},{"$f":"IF(AA$2<>\"\",LimitLookup(AA$2,PrøverVandret!Regelsæt,1),\"\")","v":""},{"$f":"IF(AB$2<>\"\",LimitLookup(AB$2,PrøverVandret!Regelsæt,1),\"\")","v":""},{"$f":"IF(AC$2<>\"\",LimitLookup(AC$2,PrøverVandret!Regelsæt,1),\"\")","v":""},{"$f":"IF(AD$2<>\"\",LimitLookup(AD$2,PrøverVandret!Regelsæt,1),\"\")","v":""},{"$f":"IF(AE$2<>\"\",LimitLookup(AE$2,PrøverVandret!Regelsæt,1),\"\")","v":""},{"$f":"IF(AF$2<>\"\",LimitLookup(AF$2,PrøverVandret!Regelsæt,1),\"\")","v":""},{"$f":"IF(AG$2<>\"\",LimitLookup(AG$2,PrøverVandret!Regelsæt,1),\"\")","v":""},{"$f":"IF(AH$2<>\"\",LimitLookup(AH$2,PrøverVandret!Regelsæt,1),\"\")","v":""},{"$f":"IF(AI$2<>\"\",LimitLookup(AI$2,PrøverVandret!Regelsæt,1),\"\")","v":""},{"$f":"IF(AJ$2<>\"\",LimitLookup(AJ$2,PrøverVandret!Regelsæt,1),\"\")","v":""},{"$f":"IF(AK$2<>\"\",LimitLookup(AK$2,PrøverVandret!Regelsæt,1),\"\")","v":""},{"$f":"IF(AL$2<>\"\",LimitLookup(AL$2,PrøverVandret!Regelsæt,1),\"\")","v":""},{"$f":"IF(AM$2<>\"\",LimitLookup(AM$2,PrøverVandret!Regelsæt,1),\"\")","v":""},{"$f":"IF(AN$2<>\"\",LimitLookup(AN$2,PrøverVandret!Regelsæt,1),\"\")","v":""},{"$f":"IF(AO$2<>\"\",LimitLookup(AO$2,PrøverVandret!Regelsæt,1),\"\")","v":""},{"$f":"IF(AP$2<>\"\",LimitLookup(AP$2,PrøverVandret!Regelsæt,1),\"\")","v":""},{"$f":"IF(AQ$2<>\"\",LimitLookup(AQ$2,PrøverVandret!Regelsæt,1),\"\")","v":""},{"$f":"IF(AR$2<>\"\",LimitLookup(AR$2,PrøverVandret!Regelsæt,1),\"\")","v":""},{"$f":"IF(AS$2<>\"\",LimitLookup(AS$2,PrøverVandret!Regelsæt,1),\"\")","v":""},{"$f":"IF(AT$2<>\"\",LimitLookup(AT$2,PrøverVandret!Regelsæt,1),\"\")","v":""},{"$f":"IF(AU$2<>\"\",LimitLookup(AU$2,PrøverVandret!Regelsæt,1),\"\")","v":""},{"$f":"IF(AV$2<>\"\",LimitLookup(AV$2,PrøverVandret!Regelsæt,1),\"\")","v":""},{"$f":"IF(AW$2<>\"\",LimitLookup(AW$2,PrøverVandret!Regelsæt,1),\"\")","v":""},{"$f":"IF(AX$2<>\"\",LimitLookup(AX$2,PrøverVandret!Regelsæt,1),\"\")","v":""},{"$f":"IF(AY$2<>\"\",LimitLookup(AY$2,PrøverVandret!Regelsæt,1),\"\")","v":""},{"$f":"IF(AZ$2<>\"\",LimitLookup(AZ$2,PrøverVandret!Regelsæt,1),\"\")","v":""},{"$f":"IF(BA$2<>\"\",LimitLookup(BA$2,PrøverVandret!Regelsæt,1),\"\")","v":""},{"$f":"IF(BB$2<>\"\",LimitLookup(BB$2,PrøverVandret!Regelsæt,1),\"\")","v":""},{"$f":"IF(BC$2<>\"\",LimitLookup(BC$2,PrøverVandret!Regelsæt,1),\"\")","v":""},{"$f":"IF(BD$2<>\"\",LimitLookup(BD$2,PrøverVandret!Regelsæt,1),\"\")","v":""},{"$f":"IF(BE$2<>\"\",LimitLookup(BE$2,PrøverVandret!Regelsæt,1),\"\")","v":""},{"$f":"IF(BF$2<>\"\",LimitLookup(BF$2,PrøverVandret!Regelsæt,1),\"\")","v":""},{"$f":"IF(BG$2<>\"\",LimitLookup(BG$2,PrøverVandret!Regelsæt,1),\"\")","v":""},{"$f":"IF(BH$2<>\"\",LimitLookup(BH$2,PrøverVandret!Regelsæt,1),\"\")","v":""},{"$f":"IF(BI$2<>\"\",LimitLookup(BI$2,PrøverVandret!Regelsæt,1),\"\")","v":""},{"$f":"IF(BJ$2<>\"\",LimitLookup(BJ$2,PrøverVandret!Regelsæt,1),\"\")","v":""},{"$f":"IF(BK$2<>\"\",LimitLookup(BK$2,PrøverVandret!Regelsæt,1),\"\")","v":""},{"$f":"IF(BL$2<>\"\",LimitLookup(BL$2,PrøverVandret!Regelsæt,1),\"\")","v":""},{"$f":"IF(BM$2<>\"\",LimitLookup(BM$2,PrøverVandret!Regelsæt,1),\"\")","v":""},{"$f":"IF(BN$2<>\"\",LimitLookup(BN$2,PrøverVandret!Regelsæt,1),\"\")","v":""},{"$f":"IF(BO$2<>\"\",LimitLookup(BO$2,PrøverVandret!Regelsæt,1),\"\")","v":""},{"$f":"IF(BP$2<>\"\",LimitLookup(BP$2,PrøverVandret!Regelsæt,1),\"\")","v":""},{"$f":"IF(BQ$2<>\"\",LimitLookup(BQ$2,PrøverVandret!Regelsæt,1),\"\")","v":""},{"$f":"IF(BR$2<>\"\",LimitLookup(BR$2,PrøverVandret!Regelsæt,1),\"\")","v":""},{"$f":"IF(BS$2<>\"\",LimitLookup(BS$2,PrøverVandret!Regelsæt,1),\"\")","v":""},{"$f":"IF(BT$2<>\"\",LimitLookup(BT$2,PrøverVandret!Regelsæt,1),\"\")","v":""},{"$f":"IF(BU$2<>\"\",LimitLookup(BU$2,PrøverVandret!Regelsæt,1),\"\")","v":""},{"$f":"IF(BV$2<>\"\",LimitLookup(BV$2,PrøverVandret!Regelsæt,1),\"\")","v":""},{"$f":"IF(BW$2<>\"\",LimitLookup(BW$2,PrøverVandret!Regelsæt,1),\"\")","v":""},{"$f":"IF(BX$2<>\"\",LimitLookup(BX$2,PrøverVandret!Regelsæt,1),\"\")","v":""},{"$f":"IF(BY$2<>\"\",LimitLookup(BY$2,PrøverVandret!Regelsæt,1),\"\")","v":""},{"$f":"IF(BZ$2<>\"\",LimitLookup(BZ$2,PrøverVandret!Regelsæt,1),\"\")","v":""},{"$f":"IF(CA$2<>\"\",LimitLookup(CA$2,PrøverVandret!Regelsæt,1),\"\")","v":""},{"$f":"IF(CB$2<>\"\",LimitLookup(CB$2,PrøverVandret!Regelsæt,1),\"\")","v":""},{"$f":"IF(CC$2<>\"\",LimitLookup(CC$2,PrøverVandret!Regelsæt,1),\"\")","v":""},{"$f":"IF(CD$2<>\"\",LimitLookup(CD$2,PrøverVandret!Regelsæt,1),\"\")","v":""},{"$f":"IF(CE$2<>\"\",LimitLookup(CE$2,PrøverVandret!Regelsæt,1),\"\")","v":""},{"$f":"IF(CF$2<>\"\",LimitLookup(CF$2,PrøverVandret!Regelsæt,1),\"\")","v":""},{"$f":"IF(CG$2<>\"\",LimitLookup(CG$2,PrøverVandret!Regelsæt,1),\"\")","v":""},{"$f":"IF(CH$2<>\"\",LimitLookup(CH$2,PrøverVandret!Regelsæt,1),\"\")","v":""},{"$f":"IF(CI$2<>\"\",LimitLookup(CI$2,PrøverVandret!Regelsæt,1),\"\")","v":""},{"$f":"IF(CJ$2<>\"\",LimitLookup(CJ$2,PrøverVandret!Regelsæt,1),\"\")","v":""},{"$f":"IF(CK$2<>\"\",LimitLookup(CK$2,PrøverVandret!Regelsæt,1),\"\")","v":""},{"$f":"IF(CL$2<>\"\",LimitLookup(CL$2,PrøverVandret!Regelsæt,1),\"\")","v":""},{"$f":"IF(CM$2<>\"\",LimitLookup(CM$2,PrøverVandret!Regelsæt,1),\"\")","v":""},{"$f":"IF(CN$2<>\"\",LimitLookup(CN$2,PrøverVandret!Regelsæt,1),\"\")","v":""},{"$f":"IF(CO$2<>\"\",LimitLookup(CO$2,PrøverVandret!Regelsæt,1),\"\")","v":""},{"$f":"IF(CP$2<>\"\",LimitLookup(CP$2,PrøverVandret!Regelsæt,1),\"\")","v":""},{"$f":"IF(CQ$2<>\"\",LimitLookup(CQ$2,PrøverVandret!Regelsæt,1),\"\")","v":""},{"$f":"IF(CR$2<>\"\",LimitLookup(CR$2,PrøverVandret!Regelsæt,1),\"\")","v":""},{"$f":"IF(CS$2<>\"\",LimitLookup(CS$2,PrøverVandret!Regelsæt,1),\"\")","v":""},{"$f":"IF(CT$2<>\"\",LimitLookup(CT$2,PrøverVandret!Regelsæt,1),\"\")","v":""},{"$f":"IF(CU$2<>\"\",LimitLookup(CU$2,PrøverVandret!Regelsæt,1),\"\")","v":""},{"$f":"IF(CV$2<>\"\",LimitLookup(CV$2,PrøverVandret!Regelsæt,1),\"\")","v":""},{"$f":"IF(CW$2<>\"\",LimitLookup(CW$2,PrøverVandret!Regelsæt,1),\"\")","v":""},{"$f":"IF(CX$2<>\"\",LimitLookup(CX$2,PrøverVandret!Regelsæt,1),\"\")","v":""},{"$f":"IF(CY$2<>\"\",LimitLookup(CY$2,PrøverVandret!Regelsæt,1),\"\")","v":""},{"$f":"IF(CZ$2<>\"\",LimitLookup(CZ$2,PrøverVandret!Regelsæt,1),\"\")","v":""},{"$f":"IF(DA$2<>\"\",LimitLookup(DA$2,PrøverVandret!Regelsæt,1),\"\")","v":""}]
[null,null,null,"Kategori 2","<=",{"$f":"IF(F$2<>\"\",LimitLookup(F$2,PrøverVandret!Regelsæt,2),\"\")","v":""},{"$f":"IF(G$2<>\"\",LimitLookup(G$2,PrøverVandret!Regelsæt,2),\"\")","v":"400"},{"$f":"IF(H$2<>\"\",LimitLookup(H$2,PrøverVandret!Regelsæt,2),\"\")","v":"5"},{"$f":"IF(I$2<>\"\",LimitLookup(I$2,PrøverVandret!Regelsæt,2),\"\")","v":"1000"},{"$f":"IF(J$2<>\"\",LimitLookup(J$2,PrøverVandret!Regelsæt,2),\"\")","v":"1000"},{"$f":"IF(K$2<>\"\",LimitLookup(K$2,PrøverVandret!Regelsæt,2),\"\")","v":"30"},{"$f":"IF(L$2<>\"\",LimitLookup(L$2,PrøverVandret!Regelsæt,2),\"\")","v":"1000"},{"$f":"IF(M$2<>\"\",LimitLookup(M$2,PrøverVandret!Regelsæt,2),\"\")","v":"25"},{"$f":"IF(N$2<>\"\",LimitLookup(N$2,PrøverVandret!Regelsæt,2),\"\")","v":"40"},{"$f":"IF(O$2<>\"\",LimitLookup(O$2,PrøverVandret!Regelsæt,2),\"\")","v":"55"},{"$f":"IF(P$2<>\"\",LimitLookup(P$2,PrøverVandret!Regelsæt,2),\"\")","v":"300"},{"$f":"IF(Q$2<>\"\",LimitLookup(Q$2,PrøverVandret!Regelsæt,2),\"\")","v":"-"},{"$f":"IF(R$2<>\"\",LimitLookup(R$2,PrøverVandret!Regelsæt,2),\"\")","v":"300"},{"$f":"IF(S$2<>\"\",LimitLookup(S$2,PrøverVandret!Regelsæt,2),\"\")","v":"-"},{"$f":"IF(T$2<>\"\",LimitLookup(T$2,PrøverVandret!Regelsæt,2),\"\")","v":"-"},{"$f":"IF(U$2<>\"\",LimitLookup(U$2,PrøverVandret!Regelsæt,2),\"\")","v":"3"},{"$f":"IF(V$2<>\"\",LimitLookup(V$2,PrøverVandret!Regelsæt,2),\"\")","v":"-"},{"$f":"IF(W$2<>\"\",LimitLookup(W$2,PrøverVandret!Regelsæt,2),\"\")","v":"3"},{"$f":"IF(X$2<>\"\",LimitLookup(X$2,PrøverVandret!Regelsæt,2),\"\")","v":"40"},{"$f":"IF(Y$2<>\"\",LimitLookup(Y$2,PrøverVandret!Regelsæt,2),\"\")","v":""},{"$f":"IF(Z$2<>\"\",LimitLookup(Z$2,PrøverVandret!Regelsæt,2),\"\")","v":""},{"$f":"IF(AA$2<>\"\",LimitLookup(AA$2,PrøverVandret!Regelsæt,2),\"\")","v":""},{"$f":"IF(AB$2<>\"\",LimitLookup(AB$2,PrøverVandret!Regelsæt,2),\"\")","v":""},{"$f":"IF(AC$2<>\"\",LimitLookup(AC$2,PrøverVandret!Regelsæt,2),\"\")","v":""},{"$f":"IF(AD$2<>\"\",LimitLookup(AD$2,PrøverVandret!Regelsæt,2),\"\")","v":""},{"$f":"IF(AE$2<>\"\",LimitLookup(AE$2,PrøverVandret!Regelsæt,2),\"\")","v":""},{"$f":"IF(AF$2<>\"\",LimitLookup(AF$2,PrøverVandret!Regelsæt,2),\"\")","v":""},{"$f":"IF(AG$2<>\"\",LimitLookup(AG$2,PrøverVandret!Regelsæt,2),\"\")","v":""},{"$f":"IF(AH$2<>\"\",LimitLookup(AH$2,PrøverVandret!Regelsæt,2),\"\")","v":""},{"$f":"IF(AI$2<>\"\",LimitLookup(AI$2,PrøverVandret!Regelsæt,2),\"\")","v":""},{"$f":"IF(AJ$2<>\"\",LimitLookup(AJ$2,PrøverVandret!Regelsæt,2),\"\")","v":""},{"$f":"IF(AK$2<>\"\",LimitLookup(AK$2,PrøverVandret!Regelsæt,2),\"\")","v":""},{"$f":"IF(AL$2<>\"\",LimitLookup(AL$2,PrøverVandret!Regelsæt,2),\"\")","v":""},{"$f":"IF(AM$2<>\"\",LimitLookup(AM$2,PrøverVandret!Regelsæt,2),\"\")","v":""},{"$f":"IF(AN$2<>\"\",LimitLookup(AN$2,PrøverVandret!Regelsæt,2),\"\")","v":""},{"$f":"IF(AO$2<>\"\",LimitLookup(AO$2,PrøverVandret!Regelsæt,2),\"\")","v":""},{"$f":"IF(AP$2<>\"\",LimitLookup(AP$2,PrøverVandret!Regelsæt,2),\"\")","v":""},{"$f":"IF(AQ$2<>\"\",LimitLookup(AQ$2,PrøverVandret!Regelsæt,2),\"\")","v":""},{"$f":"IF(AR$2<>\"\",LimitLookup(AR$2,PrøverVandret!Regelsæt,2),\"\")","v":""},{"$f":"IF(AS$2<>\"\",LimitLookup(AS$2,PrøverVandret!Regelsæt,2),\"\")","v":""},{"$f":"IF(AT$2<>\"\",LimitLookup(AT$2,PrøverVandret!Regelsæt,2),\"\")","v":""},{"$f":"IF(AU$2<>\"\",LimitLookup(AU$2,PrøverVandret!Regelsæt,2),\"\")","v":""},{"$f":"IF(AV$2<>\"\",LimitLookup(AV$2,PrøverVandret!Regelsæt,2),\"\")","v":""},{"$f":"IF(AW$2<>\"\",LimitLookup(AW$2,PrøverVandret!Regelsæt,2),\"\")","v":""},{"$f":"IF(AX$2<>\"\",LimitLookup(AX$2,PrøverVandret!Regelsæt,2),\"\")","v":""},{"$f":"IF(AY$2<>\"\",LimitLookup(AY$2,PrøverVandret!Regelsæt,2),\"\")","v":""},{"$f":"IF(AZ$2<>\"\",LimitLookup(AZ$2,PrøverVandret!Regelsæt,2),\"\")","v":""},{"$f":"IF(BA$2<>\"\",LimitLookup(BA$2,PrøverVandret!Regelsæt,2),\"\")","v":""},{"$f":"IF(BB$2<>\"\",LimitLookup(BB$2,PrøverVandret!Regelsæt,2),\"\")","v":""},{"$f":"IF(BC$2<>\"\",LimitLookup(BC$2,PrøverVandret!Regelsæt,2),\"\")","v":""},{"$f":"IF(BD$2<>\"\",LimitLookup(BD$2,PrøverVandret!Regelsæt,2),\"\")","v":""},{"$f":"IF(BE$2<>\"\",LimitLookup(BE$2,PrøverVandret!Regelsæt,2),\"\")","v":""},{"$f":"IF(BF$2<>\"\",LimitLookup(BF$2,PrøverVandret!Regelsæt,2),\"\")","v":""},{"$f":"IF(BG$2<>\"\",LimitLookup(BG$2,PrøverVandret!Regelsæt,2),\"\")","v":""},{"$f":"IF(BH$2<>\"\",LimitLookup(BH$2,PrøverVandret!Regelsæt,2),\"\")","v":""},{"$f":"IF(BI$2<>\"\",LimitLookup(BI$2,PrøverVandret!Regelsæt,2),\"\")","v":""},{"$f":"IF(BJ$2<>\"\",LimitLookup(BJ$2,PrøverVandret!Regelsæt,2),\"\")","v":""},{"$f":"IF(BK$2<>\"\",LimitLookup(BK$2,PrøverVandret!Regelsæt,2),\"\")","v":""},{"$f":"IF(BL$2<>\"\",LimitLookup(BL$2,PrøverVandret!Regelsæt,2),\"\")","v":""},{"$f":"IF(BM$2<>\"\",LimitLookup(BM$2,PrøverVandret!Regelsæt,2),\"\")","v":""},{"$f":"IF(BN$2<>\"\",LimitLookup(BN$2,PrøverVandret!Regelsæt,2),\"\")","v":""},{"$f":"IF(BO$2<>\"\",LimitLookup(BO$2,PrøverVandret!Regelsæt,2),\"\")","v":""},{"$f":"IF(BP$2<>\"\",LimitLookup(BP$2,PrøverVandret!Regelsæt,2),\"\")","v":""},{"$f":"IF(BQ$2<>\"\",LimitLookup(BQ$2,PrøverVandret!Regelsæt,2),\"\")","v":""},{"$f":"IF(BR$2<>\"\",LimitLookup(BR$2,PrøverVandret!Regelsæt,2),\"\")","v":""},{"$f":"IF(BS$2<>\"\",LimitLookup(BS$2,PrøverVandret!Regelsæt,2),\"\")","v":""},{"$f":"IF(BT$2<>\"\",LimitLookup(BT$2,PrøverVandret!Regelsæt,2),\"\")","v":""},{"$f":"IF(BU$2<>\"\",LimitLookup(BU$2,PrøverVandret!Regelsæt,2),\"\")","v":""},{"$f":"IF(BV$2<>\"\",LimitLookup(BV$2,PrøverVandret!Regelsæt,2),\"\")","v":""},{"$f":"IF(BW$2<>\"\",LimitLookup(BW$2,PrøverVandret!Regelsæt,2),\"\")","v":""},{"$f":"IF(BX$2<>\"\",LimitLookup(BX$2,PrøverVandret!Regelsæt,2),\"\")","v":""},{"$f":"IF(BY$2<>\"\",LimitLookup(BY$2,PrøverVandret!Regelsæt,2),\"\")","v":""},{"$f":"IF(BZ$2<>\"\",LimitLookup(BZ$2,PrøverVandret!Regelsæt,2),\"\")","v":""},{"$f":"IF(CA$2<>\"\",LimitLookup(CA$2,PrøverVandret!Regelsæt,2),\"\")","v":""},{"$f":"IF(CB$2<>\"\",LimitLookup(CB$2,PrøverVandret!Regelsæt,2),\"\")","v":""},{"$f":"IF(CC$2<>\"\",LimitLookup(CC$2,PrøverVandret!Regelsæt,2),\"\")","v":""},{"$f":"IF(CD$2<>\"\",LimitLookup(CD$2,PrøverVandret!Regelsæt,2),\"\")","v":""},{"$f":"IF(CE$2<>\"\",LimitLookup(CE$2,PrøverVandret!Regelsæt,2),\"\")","v":""},{"$f":"IF(CF$2<>\"\",LimitLookup(CF$2,PrøverVandret!Regelsæt,2),\"\")","v":""},{"$f":"IF(CG$2<>\"\",LimitLookup(CG$2,PrøverVandret!Regelsæt,2),\"\")","v":""},{"$f":"IF(CH$2<>\"\",LimitLookup(CH$2,PrøverVandret!Regelsæt,2),\"\")","v":""},{"$f":"IF(CI$2<>\"\",LimitLookup(CI$2,PrøverVandret!Regelsæt,2),\"\")","v":""},{"$f":"IF(CJ$2<>\"\",LimitLookup(CJ$2,PrøverVandret!Regelsæt,2),\"\")","v":""},{"$f":"IF(CK$2<>\"\",LimitLookup(CK$2,PrøverVandret!Regelsæt,2),\"\")","v":""},{"$f":"IF(CL$2<>\"\",LimitLookup(CL$2,PrøverVandret!Regelsæt,2),\"\")","v":""},{"$f":"IF(CM$2<>\"\",LimitLookup(CM$2,PrøverVandret!Regelsæt,2),\"\")","v":""},{"$f":"IF(CN$2<>\"\",LimitLookup(CN$2,PrøverVandret!Regelsæt,2),\"\")","v":""},{"$f":"IF(CO$2<>\"\",LimitLookup(CO$2,PrøverVandret!Regelsæt,2),\"\")","v":""},{"$f":"IF(CP$2<>\"\",LimitLookup(CP$2,PrøverVandret!Regelsæt,2),\"\")","v":""},{"$f":"IF(CQ$2<>\"\",LimitLookup(CQ$2,PrøverVandret!Regelsæt,2),\"\")","v":""},{"$f":"IF(CR$2<>\"\",LimitLookup(CR$2,PrøverVandret!Regelsæt,2),\"\")","v":""},{"$f":"IF(CS$2<>\"\",LimitLookup(CS$2,PrøverVandret!Regelsæt,2),\"\")","v":""},{"$f":"IF(CT$2<>\"\",LimitLookup(CT$2,PrøverVandret!Regelsæt,2),\"\")","v":""},{"$f":"IF(CU$2<>\"\",LimitLookup(CU$2,PrøverVandret!Regelsæt,2),\"\")","v":""},{"$f":"IF(CV$2<>\"\",LimitLookup(CV$2,PrøverVandret!Regelsæt,2),\"\")","v":""},{"$f":"IF(CW$2<>\"\",LimitLookup(CW$2,PrøverVandret!Regelsæt,2),\"\")","v":""},{"$f":"IF(CX$2<>\"\",LimitLookup(CX$2,PrøverVandret!Regelsæt,2),\"\")","v":""},{"$f":"IF(CY$2<>\"\",LimitLookup(CY$2,PrøverVandret!Regelsæt,2),\"\")","v":""},{"$f":"IF(CZ$2<>\"\",LimitLookup(CZ$2,PrøverVandret!Regelsæt,2),\"\")","v":""},{"$f":"IF(DA$2<>\"\",LimitLookup(DA$2,PrøverVandret!Regelsæt,2),\"\")","v":""}]
[null,null,null,"Udenfor Kat.",">",{"$f":"IF(F$2<>\"\",LimitLookup(F$2,PrøverVandret!Regelsæt,3),\"\")","v":""},{"$f":"IF(G$2<>\"\",LimitLookup(G$2,PrøverVandret!Regelsæt,3),\"\")","v":"400"},{"$f":"IF(H$2<>\"\",LimitLookup(H$2,PrøverVandret!Regelsæt,3),\"\")","v":"5"},{"$f":"IF(I$2<>\"\",LimitLookup(I$2,PrøverVandret!Regelsæt,3),\"\")","v":"1000"},{"$f":"IF(J$2<>\"\",LimitLookup(J$2,PrøverVandret!Regelsæt,3),\"\")","v":"1000"},{"$f":"IF(K$2<>\"\",LimitLookup(K$2,PrøverVandret!Regelsæt,3),\"\")","v":"30"},{"$f":"IF(L$2<>\"\",LimitLookup(L$2,PrøverVandret!Regelsæt,3),\"\")","v":"1000"},{"$f":"IF(M$2<>\"\",LimitLookup(M$2,PrøverVandret!Regelsæt,3),\"\")","v":"25"},{"$f":"IF(N$2<>\"\",LimitLookup(N$2,PrøverVandret!Regelsæt,3),\"\")","v":"40"},{"$f":"IF(O$2<>\"\",LimitLookup(O$2,PrøverVandret!Regelsæt,3),\"\")","v":"55"},{"$f":"IF(P$2<>\"\",LimitLookup(P$2,PrøverVandret!Regelsæt,3),\"\")","v":"300"},{"$f":"IF(Q$2<>\"\",LimitLookup(Q$2,PrøverVandret!Regelsæt,3),\"\")","v":"-"},{"$f":"IF(R$2<>\"\",LimitLookup(R$2,PrøverVandret!Regelsæt,3),\"\")","v":"300"},{"$f":"IF(S$2<>\"\",LimitLookup(S$2,PrøverVandret!Regelsæt,3),\"\")","v":"-"},{"$f":"IF(T$2<>\"\",LimitLookup(T$2,PrøverVandret!Regelsæt,3),\"\")","v":"-"},{"$f":"IF(U$2<>\"\",LimitLookup(U$2,PrøverVandret!Regelsæt,3),\"\")","v":"3"},{"$f":"IF(V$2<>\"\",LimitLookup(V$2,PrøverVandret!Regelsæt,3),\"\")","v":"-"},{"$f":"IF(W$2<>\"\",LimitLookup(W$2,PrøverVandret!Regelsæt,3),\"\")","v":"3"},{"$f":"IF(X$2<>\"\",LimitLookup(X$2,PrøverVandret!Regelsæt,3),\"\")","v":"40"},{"$f":"IF(Y$2<>\"\",LimitLookup(Y$2,PrøverVandret!Regelsæt,3),\"\")","v":""},{"$f":"IF(Z$2<>\"\",LimitLookup(Z$2,PrøverVandret!Regelsæt,3),\"\")","v":""},{"$f":"IF(AA$2<>\"\",LimitLookup(AA$2,PrøverVandret!Regelsæt,3),\"\")","v":""},{"$f":"IF(AB$2<>\"\",LimitLookup(AB$2,PrøverVandret!Regelsæt,3),\"\")","v":""},{"$f":"IF(AC$2<>\"\",LimitLookup(AC$2,PrøverVandret!Regelsæt,3),\"\")","v":""},{"$f":"IF(AD$2<>\"\",LimitLookup(AD$2,PrøverVandret!Regelsæt,3),\"\")","v":""},{"$f":"IF(AE$2<>\"\",LimitLookup(AE$2,PrøverVandret!Regelsæt,3),\"\")","v":""},{"$f":"IF(AF$2<>\"\",LimitLookup(AF$2,PrøverVandret!Regelsæt,3),\"\")","v":""},{"$f":"IF(AG$2<>\"\",LimitLookup(AG$2,PrøverVandret!Regelsæt,3),\"\")","v":""},{"$f":"IF(AH$2<>\"\",LimitLookup(AH$2,PrøverVandret!Regelsæt,3),\"\")","v":""},{"$f":"IF(AI$2<>\"\",LimitLookup(AI$2,PrøverVandret!Regelsæt,3),\"\")","v":""},{"$f":"IF(AJ$2<>\"\",LimitLookup(AJ$2,PrøverVandret!Regelsæt,3),\"\")","v":""},{"$f":"IF(AK$2<>\"\",LimitLookup(AK$2,PrøverVandret!Regelsæt,3),\"\")","v":""},{"$f":"IF(AL$2<>\"\",LimitLookup(AL$2,PrøverVandret!Regelsæt,3),\"\")","v":""},{"$f":"IF(AM$2<>\"\",LimitLookup(AM$2,PrøverVandret!Regelsæt,3),\"\")","v":""},{"$f":"IF(AN$2<>\"\",LimitLookup(AN$2,PrøverVandret!Regelsæt,3),\"\")","v":""},{"$f":"IF(AO$2<>\"\",LimitLookup(AO$2,PrøverVandret!Regelsæt,3),\"\")","v":""},{"$f":"IF(AP$2<>\"\",LimitLookup(AP$2,PrøverVandret!Regelsæt,3),\"\")","v":""},{"$f":"IF(AQ$2<>\"\",LimitLookup(AQ$2,PrøverVandret!Regelsæt,3),\"\")","v":""},{"$f":"IF(AR$2<>\"\",LimitLookup(AR$2,PrøverVandret!Regelsæt,3),\"\")","v":""},{"$f":"IF(AS$2<>\"\",LimitLookup(AS$2,PrøverVandret!Regelsæt,3),\"\")","v":""},{"$f":"IF(AT$2<>\"\",LimitLookup(AT$2,PrøverVandret!Regelsæt,3),\"\")","v":""},{"$f":"IF(AU$2<>\"\",LimitLookup(AU$2,PrøverVandret!Regelsæt,3),\"\")","v":""},{"$f":"IF(AV$2<>\"\",LimitLookup(AV$2,PrøverVandret!Regelsæt,3),\"\")","v":""},{"$f":"IF(AW$2<>\"\",LimitLookup(AW$2,PrøverVandret!Regelsæt,3),\"\")","v":""},{"$f":"IF(AX$2<>\"\",LimitLookup(AX$2,PrøverVandret!Regelsæt,3),\"\")","v":""},{"$f":"IF(AY$2<>\"\",LimitLookup(AY$2,PrøverVandret!Regelsæt,3),\"\")","v":""},{"$f":"IF(AZ$2<>\"\",LimitLookup(AZ$2,PrøverVandret!Regelsæt,3),\"\")","v":""},{"$f":"IF(BA$2<>\"\",LimitLookup(BA$2,PrøverVandret!Regelsæt,3),\"\")","v":""},{"$f":"IF(BB$2<>\"\",LimitLookup(BB$2,PrøverVandret!Regelsæt,3),\"\")","v":""},{"$f":"IF(BC$2<>\"\",LimitLookup(BC$2,PrøverVandret!Regelsæt,3),\"\")","v":""},{"$f":"IF(BD$2<>\"\",LimitLookup(BD$2,PrøverVandret!Regelsæt,3),\"\")","v":""},{"$f":"IF(BE$2<>\"\",LimitLookup(BE$2,PrøverVandret!Regelsæt,3),\"\")","v":""},{"$f":"IF(BF$2<>\"\",LimitLookup(BF$2,PrøverVandret!Regelsæt,3),\"\")","v":""},{"$f":"IF(BG$2<>\"\",LimitLookup(BG$2,PrøverVandret!Regelsæt,3),\"\")","v":""},{"$f":"IF(BH$2<>\"\",LimitLookup(BH$2,PrøverVandret!Regelsæt,3),\"\")","v":""},{"$f":"IF(BI$2<>\"\",LimitLookup(BI$2,PrøverVandret!Regelsæt,3),\"\")","v":""},{"$f":"IF(BJ$2<>\"\",LimitLookup(BJ$2,PrøverVandret!Regelsæt,3),\"\")","v":""},{"$f":"IF(BK$2<>\"\",LimitLookup(BK$2,PrøverVandret!Regelsæt,3),\"\")","v":""},{"$f":"IF(BL$2<>\"\",LimitLookup(BL$2,PrøverVandret!Regelsæt,3),\"\")","v":""},{"$f":"IF(BM$2<>\"\",LimitLookup(BM$2,PrøverVandret!Regelsæt,3),\"\")","v":""},{"$f":"IF(BN$2<>\"\",LimitLookup(BN$2,PrøverVandret!Regelsæt,3),\"\")","v":""},{"$f":"IF(BO$2<>\"\",LimitLookup(BO$2,PrøverVandret!Regelsæt,3),\"\")","v":""},{"$f":"IF(BP$2<>\"\",LimitLookup(BP$2,PrøverVandret!Regelsæt,3),\"\")","v":""},{"$f":"IF(BQ$2<>\"\",LimitLookup(BQ$2,PrøverVandret!Regelsæt,3),\"\")","v":""},{"$f":"IF(BR$2<>\"\",LimitLookup(BR$2,PrøverVandret!Regelsæt,3),\"\")","v":""},{"$f":"IF(BS$2<>\"\",LimitLookup(BS$2,PrøverVandret!Regelsæt,3),\"\")","v":""},{"$f":"IF(BT$2<>\"\",LimitLookup(BT$2,PrøverVandret!Regelsæt,3),\"\")","v":""},{"$f":"IF(BU$2<>\"\",LimitLookup(BU$2,PrøverVandret!Regelsæt,3),\"\")","v":""},{"$f":"IF(BV$2<>\"\",LimitLookup(BV$2,PrøverVandret!Regelsæt,3),\"\")","v":""},{"$f":"IF(BW$2<>\"\",LimitLookup(BW$2,PrøverVandret!Regelsæt,3),\"\")","v":""},{"$f":"IF(BX$2<>\"\",LimitLookup(BX$2,PrøverVandret!Regelsæt,3),\"\")","v":""},{"$f":"IF(BY$2<>\"\",LimitLookup(BY$2,PrøverVandret!Regelsæt,3),\"\")","v":""},{"$f":"IF(BZ$2<>\"\",LimitLookup(BZ$2,PrøverVandret!Regelsæt,3),\"\")","v":""},{"$f":"IF(CA$2<>\"\",LimitLookup(CA$2,PrøverVandret!Regelsæt,3),\"\")","v":""},{"$f":"IF(CB$2<>\"\",LimitLookup(CB$2,PrøverVandret!Regelsæt,3),\"\")","v":""},{"$f":"IF(CC$2<>\"\",LimitLookup(CC$2,PrøverVandret!Regelsæt,3),\"\")","v":""},{"$f":"IF(CD$2<>\"\",LimitLookup(CD$2,PrøverVandret!Regelsæt,3),\"\")","v":""},{"$f":"IF(CE$2<>\"\",LimitLookup(CE$2,PrøverVandret!Regelsæt,3),\"\")","v":""},{"$f":"IF(CF$2<>\"\",LimitLookup(CF$2,PrøverVandret!Regelsæt,3),\"\")","v":""},{"$f":"IF(CG$2<>\"\",LimitLookup(CG$2,PrøverVandret!Regelsæt,3),\"\")","v":""},{"$f":"IF(CH$2<>\"\",LimitLookup(CH$2,PrøverVandret!Regelsæt,3),\"\")","v":""},{"$f":"IF(CI$2<>\"\",LimitLookup(CI$2,PrøverVandret!Regelsæt,3),\"\")","v":""},{"$f":"IF(CJ$2<>\"\",LimitLookup(CJ$2,PrøverVandret!Regelsæt,3),\"\")","v":""},{"$f":"IF(CK$2<>\"\",LimitLookup(CK$2,PrøverVandret!Regelsæt,3),\"\")","v":""},{"$f":"IF(CL$2<>\"\",LimitLookup(CL$2,PrøverVandret!Regelsæt,3),\"\")","v":""},{"$f":"IF(CM$2<>\"\",LimitLookup(CM$2,PrøverVandret!Regelsæt,3),\"\")","v":""},{"$f":"IF(CN$2<>\"\",LimitLookup(CN$2,PrøverVandret!Regelsæt,3),\"\")","v":""},{"$f":"IF(CO$2<>\"\",LimitLookup(CO$2,PrøverVandret!Regelsæt,3),\"\")","v":""},{"$f":"IF(CP$2<>\"\",LimitLookup(CP$2,PrøverVandret!Regelsæt,3),\"\")","v":""},{"$f":"IF(CQ$2<>\"\",LimitLookup(CQ$2,PrøverVandret!Regelsæt,3),\"\")","v":""},{"$f":"IF(CR$2<>\"\",LimitLookup(CR$2,PrøverVandret!Regelsæt,3),\"\")","v":""},{"$f":"IF(CS$2<>\"\",LimitLookup(CS$2,PrøverVandret!Regelsæt,3),\"\")","v":""},{"$f":"IF(CT$2<>\"\",LimitLookup(CT$2,PrøverVandret!Regelsæt,3),\"\")","v":""},{"$f":"IF(CU$2<>\"\",LimitLookup(CU$2,PrøverVandret!Regelsæt,3),\"\")","v":""},{"$f":"IF(CV$2<>\"\",LimitLookup(CV$2,PrøverVandret!Regelsæt,3),\"\")","v":""},{"$f":"IF(CW$2<>\"\",LimitLookup(CW$2,PrøverVandret!Regelsæt,3),\"\")","v":""},{"$f":"IF(CX$2<>\"\",LimitLookup(CX$2,PrøverVandret!Regelsæt,3),\"\")","v":""},{"$f":"IF(CY$2<>\"\",LimitLookup(CY$2,PrøverVandret!Regelsæt,3),\"\")","v":""},{"$f":"IF(CZ$2<>\"\",LimitLookup(CZ$2,PrøverVandret!Regelsæt,3),\"\")","v":""},{"$f":"IF(DA$2<>\"\",LimitLookup(DA$2,PrøverVandret!Regelsæt,3),\"\")","v":""}]
[null,null,null,"","",{"$f":"IF(F$2<>\"\",LimitLookup(F$2,PrøverVandret!Regelsæt,4),\"\")","v":""},{"$f":"IF(G$2<>\"\",LimitLookup(G$2,PrøverVandret!Regelsæt,4),\"\")","v":""},{"$f":"IF(H$2<>\"\",LimitLookup(H$2,PrøverVandret!Regelsæt,4),\"\")","v":""},{"$f":"IF(I$2<>\"\",LimitLookup(I$2,PrøverVandret!Regelsæt,4),\"\")","v":""},{"$f":"IF(J$2<>\"\",LimitLookup(J$2,PrøverVandret!Regelsæt,4),\"\")","v":""},{"$f":"IF(K$2<>\"\",LimitLookup(K$2,PrøverVandret!Regelsæt,4),\"\")","v":""},{"$f":"IF(L$2<>\"\",LimitLookup(L$2,PrøverVandret!Regelsæt,4),\"\")","v":""},{"$f":"IF(M$2<>\"\",LimitLookup(M$2,PrøverVandret!Regelsæt,4),\"\")","v":""},{"$f":"IF(N$2<>\"\",LimitLookup(N$2,PrøverVandret!Regelsæt,4),\"\")","v":""},{"$f":"IF(O$2<>\"\",LimitLookup(O$2,PrøverVandret!Regelsæt,4),\"\")","v":""},{"$f":"IF(P$2<>\"\",LimitLookup(P$2,PrøverVandret!Regelsæt,4),\"\")","v":""},{"$f":"IF(Q$2<>\"\",LimitLookup(Q$2,PrøverVandret!Regelsæt,4),\"\")","v":""},{"$f":"IF(R$2<>\"\",LimitLookup(R$2,PrøverVandret!Regelsæt,4),\"\")","v":""},{"$f":"IF(S$2<>\"\",LimitLookup(S$2,PrøverVandret!Regelsæt,4),\"\")","v":""},{"$f":"IF(T$2<>\"\",LimitLookup(T$2,PrøverVandret!Regelsæt,4),\"\")","v":""},{"$f":"IF(U$2<>\"\",LimitLookup(U$2,PrøverVandret!Regelsæt,4),\"\")","v":""},{"$f":"IF(V$2<>\"\",LimitLookup(V$2,PrøverVandret!Regelsæt,4),\"\")","v":""},{"$f":"IF(W$2<>\"\",LimitLookup(W$2,PrøverVandret!Regelsæt,4),\"\")","v":""},{"$f":"IF(X$2<>\"\",LimitLookup(X$2,PrøverVandret!Regelsæt,4),\"\")","v":""},{"$f":"IF(Y$2<>\"\",LimitLookup(Y$2,PrøverVandret!Regelsæt,4),\"\")","v":""},{"$f":"IF(Z$2<>\"\",LimitLookup(Z$2,PrøverVandret!Regelsæt,4),\"\")","v":""},{"$f":"IF(AA$2<>\"\",LimitLookup(AA$2,PrøverVandret!Regelsæt,4),\"\")","v":""},{"$f":"IF(AB$2<>\"\",LimitLookup(AB$2,PrøverVandret!Regelsæt,4),\"\")","v":""},{"$f":"IF(AC$2<>\"\",LimitLookup(AC$2,PrøverVandret!Regelsæt,4),\"\")","v":""},{"$f":"IF(AD$2<>\"\",LimitLookup(AD$2,PrøverVandret!Regelsæt,4),\"\")","v":""},{"$f":"IF(AE$2<>\"\",LimitLookup(AE$2,PrøverVandret!Regelsæt,4),\"\")","v":""},{"$f":"IF(AF$2<>\"\",LimitLookup(AF$2,PrøverVandret!Regelsæt,4),\"\")","v":""},{"$f":"IF(AG$2<>\"\",LimitLookup(AG$2,PrøverVandret!Regelsæt,4),\"\")","v":""},{"$f":"IF(AH$2<>\"\",LimitLookup(AH$2,PrøverVandret!Regelsæt,4),\"\")","v":""},{"$f":"IF(AI$2<>\"\",LimitLookup(AI$2,PrøverVandret!Regelsæt,4),\"\")","v":""},{"$f":"IF(AJ$2<>\"\",LimitLookup(AJ$2,PrøverVandret!Regelsæt,4),\"\")","v":""},{"$f":"IF(AK$2<>\"\",LimitLookup(AK$2,PrøverVandret!Regelsæt,4),\"\")","v":""},{"$f":"IF(AL$2<>\"\",LimitLookup(AL$2,PrøverVandret!Regelsæt,4),\"\")","v":""},{"$f":"IF(AM$2<>\"\",LimitLookup(AM$2,PrøverVandret!Regelsæt,4),\"\")","v":""},{"$f":"IF(AN$2<>\"\",LimitLookup(AN$2,PrøverVandret!Regelsæt,4),\"\")","v":""},{"$f":"IF(AO$2<>\"\",LimitLookup(AO$2,PrøverVandret!Regelsæt,4),\"\")","v":""},{"$f":"IF(AP$2<>\"\",LimitLookup(AP$2,PrøverVandret!Regelsæt,4),\"\")","v":""},{"$f":"IF(AQ$2<>\"\",LimitLookup(AQ$2,PrøverVandret!Regelsæt,4),\"\")","v":""},{"$f":"IF(AR$2<>\"\",LimitLookup(AR$2,PrøverVandret!Regelsæt,4),\"\")","v":""},{"$f":"IF(AS$2<>\"\",LimitLookup(AS$2,PrøverVandret!Regelsæt,4),\"\")","v":""},{"$f":"IF(AT$2<>\"\",LimitLookup(AT$2,PrøverVandret!Regelsæt,4),\"\")","v":""},{"$f":"IF(AU$2<>\"\",LimitLookup(AU$2,PrøverVandret!Regelsæt,4),\"\")","v":""},{"$f":"IF(AV$2<>\"\",LimitLookup(AV$2,PrøverVandret!Regelsæt,4),\"\")","v":""},{"$f":"IF(AW$2<>\"\",LimitLookup(AW$2,PrøverVandret!Regelsæt,4),\"\")","v":""},{"$f":"IF(AX$2<>\"\",LimitLookup(AX$2,PrøverVandret!Regelsæt,4),\"\")","v":""},{"$f":"IF(AY$2<>\"\",LimitLookup(AY$2,PrøverVandret!Regelsæt,4),\"\")","v":""},{"$f":"IF(AZ$2<>\"\",LimitLookup(AZ$2,PrøverVandret!Regelsæt,4),\"\")","v":""},{"$f":"IF(BA$2<>\"\",LimitLookup(BA$2,PrøverVandret!Regelsæt,4),\"\")","v":""},{"$f":"IF(BB$2<>\"\",LimitLookup(BB$2,PrøverVandret!Regelsæt,4),\"\")","v":""},{"$f":"IF(BC$2<>\"\",LimitLookup(BC$2,PrøverVandret!Regelsæt,4),\"\")","v":""},{"$f":"IF(BD$2<>\"\",LimitLookup(BD$2,PrøverVandret!Regelsæt,4),\"\")","v":""},{"$f":"IF(BE$2<>\"\",LimitLookup(BE$2,PrøverVandret!Regelsæt,4),\"\")","v":""},{"$f":"IF(BF$2<>\"\",LimitLookup(BF$2,PrøverVandret!Regelsæt,4),\"\")","v":""},{"$f":"IF(BG$2<>\"\",LimitLookup(BG$2,PrøverVandret!Regelsæt,4),\"\")","v":""},{"$f":"IF(BH$2<>\"\",LimitLookup(BH$2,PrøverVandret!Regelsæt,4),\"\")","v":""},{"$f":"IF(BI$2<>\"\",LimitLookup(BI$2,PrøverVandret!Regelsæt,4),\"\")","v":""},{"$f":"IF(BJ$2<>\"\",LimitLookup(BJ$2,PrøverVandret!Regelsæt,4),\"\")","v":""},{"$f":"IF(BK$2<>\"\",LimitLookup(BK$2,PrøverVandret!Regelsæt,4),\"\")","v":""},{"$f":"IF(BL$2<>\"\",LimitLookup(BL$2,PrøverVandret!Regelsæt,4),\"\")","v":""},{"$f":"IF(BM$2<>\"\",LimitLookup(BM$2,PrøverVandret!Regelsæt,4),\"\")","v":""},{"$f":"IF(BN$2<>\"\",LimitLookup(BN$2,PrøverVandret!Regelsæt,4),\"\")","v":""},{"$f":"IF(BO$2<>\"\",LimitLookup(BO$2,PrøverVandret!Regelsæt,4),\"\")","v":""},{"$f":"IF(BP$2<>\"\",LimitLookup(BP$2,PrøverVandret!Regelsæt,4),\"\")","v":""},{"$f":"IF(BQ$2<>\"\",LimitLookup(BQ$2,PrøverVandret!Regelsæt,4),\"\")","v":""},{"$f":"IF(BR$2<>\"\",LimitLookup(BR$2,PrøverVandret!Regelsæt,4),\"\")","v":""},{"$f":"IF(BS$2<>\"\",LimitLookup(BS$2,PrøverVandret!Regelsæt,4),\"\")","v":""},{"$f":"IF(BT$2<>\"\",LimitLookup(BT$2,PrøverVandret!Regelsæt,4),\"\")","v":""},{"$f":"IF(BU$2<>\"\",LimitLookup(BU$2,PrøverVandret!Regelsæt,4),\"\")","v":""},{"$f":"IF(BV$2<>\"\",LimitLookup(BV$2,PrøverVandret!Regelsæt,4),\"\")","v":""},{"$f":"IF(BW$2<>\"\",LimitLookup(BW$2,PrøverVandret!Regelsæt,4),\"\")","v":""},{"$f":"IF(BX$2<>\"\",LimitLookup(BX$2,PrøverVandret!Regelsæt,4),\"\")","v":""},{"$f":"IF(BY$2<>\"\",LimitLookup(BY$2,PrøverVandret!Regelsæt,4),\"\")","v":""},{"$f":"IF(BZ$2<>\"\",LimitLookup(BZ$2,PrøverVandret!Regelsæt,4),\"\")","v":""},{"$f":"IF(CA$2<>\"\",LimitLookup(CA$2,PrøverVandret!Regelsæt,4),\"\")","v":""},{"$f":"IF(CB$2<>\"\",LimitLookup(CB$2,PrøverVandret!Regelsæt,4),\"\")","v":""},{"$f":"IF(CC$2<>\"\",LimitLookup(CC$2,PrøverVandret!Regelsæt,4),\"\")","v":""},{"$f":"IF(CD$2<>\"\",LimitLookup(CD$2,PrøverVandret!Regelsæt,4),\"\")","v":""},{"$f":"IF(CE$2<>\"\",LimitLookup(CE$2,PrøverVandret!Regelsæt,4),\"\")","v":""},{"$f":"IF(CF$2<>\"\",LimitLookup(CF$2,PrøverVandret!Regelsæt,4),\"\")","v":""},{"$f":"IF(CG$2<>\"\",LimitLookup(CG$2,PrøverVandret!Regelsæt,4),\"\")","v":""},{"$f":"IF(CH$2<>\"\",LimitLookup(CH$2,PrøverVandret!Regelsæt,4),\"\")","v":""},{"$f":"IF(CI$2<>\"\",LimitLookup(CI$2,PrøverVandret!Regelsæt,4),\"\")","v":""},{"$f":"IF(CJ$2<>\"\",LimitLookup(CJ$2,PrøverVandret!Regelsæt,4),\"\")","v":""},{"$f":"IF(CK$2<>\"\",LimitLookup(CK$2,PrøverVandret!Regelsæt,4),\"\")","v":""},{"$f":"IF(CL$2<>\"\",LimitLookup(CL$2,PrøverVandret!Regelsæt,4),\"\")","v":""},{"$f":"IF(CM$2<>\"\",LimitLookup(CM$2,PrøverVandret!Regelsæt,4),\"\")","v":""},{"$f":"IF(CN$2<>\"\",LimitLookup(CN$2,PrøverVandret!Regelsæt,4),\"\")","v":""},{"$f":"IF(CO$2<>\"\",LimitLookup(CO$2,PrøverVandret!Regelsæt,4),\"\")","v":""},{"$f":"IF(CP$2<>\"\",LimitLookup(CP$2,PrøverVandret!Regelsæt,4),\"\")","v":""},{"$f":"IF(CQ$2<>\"\",LimitLookup(CQ$2,PrøverVandret!Regelsæt,4),\"\")","v":""},{"$f":"IF(CR$2<>\"\",LimitLookup(CR$2,PrøverVandret!Regelsæt,4),\"\")","v":""},{"$f":"IF(CS$2<>\"\",LimitLookup(CS$2,PrøverVandret!Regelsæt,4),\"\")","v":""},{"$f":"IF(CT$2<>\"\",LimitLookup(CT$2,PrøverVandret!Regelsæt,4),\"\")","v":""},{"$f":"IF(CU$2<>\"\",LimitLookup(CU$2,PrøverVandret!Regelsæt,4),\"\")","v":""},{"$f":"IF(CV$2<>\"\",LimitLookup(CV$2,PrøverVandret!Regelsæt,4),\"\")","v":""},{"$f":"IF(CW$2<>\"\",LimitLookup(CW$2,PrøverVandret!Regelsæt,4),\"\")","v":""},{"$f":"IF(CX$2<>\"\",LimitLookup(CX$2,PrøverVandret!Regelsæt,4),\"\")","v":""},{"$f":"IF(CY$2<>\"\",LimitLookup(CY$2,PrøverVandret!Regelsæt,4),\"\")","v":""},{"$f":"IF(CZ$2<>\"\",LimitLookup(CZ$2,PrøverVandret!Regelsæt,4),\"\")","v":""},{"$f":"IF(DA$2<>\"\",LimitLookup(DA$2,PrøverVandret!Regelsæt,4),\"\")","v":""}]
[null,null,null,"","",{"$f":"IF(F$2<>\"\",LimitLookup(F$2,PrøverVandret!Regelsæt,5),\"\")","v":""},{"$f":"IF(G$2<>\"\",LimitLookup(G$2,PrøverVandret!Regelsæt,5),\"\")","v":""},{"$f":"IF(H$2<>\"\",LimitLookup(H$2,PrøverVandret!Regelsæt,5),\"\")","v":""},{"$f":"IF(I$2<>\"\",LimitLookup(I$2,PrøverVandret!Regelsæt,5),\"\")","v":""},{"$f":"IF(J$2<>\"\",LimitLookup(J$2,PrøverVandret!Regelsæt,5),\"\")","v":""},{"$f":"IF(K$2<>\"\",LimitLookup(K$2,PrøverVandret!Regelsæt,5),\"\")","v":""},{"$f":"IF(L$2<>\"\",LimitLookup(L$2,PrøverVandret!Regelsæt,5),\"\")","v":""},{"$f":"IF(M$2<>\"\",LimitLookup(M$2,PrøverVandret!Regelsæt,5),\"\")","v":""},{"$f":"IF(N$2<>\"\",LimitLookup(N$2,PrøverVandret!Regelsæt,5),\"\")","v":""},{"$f":"IF(O$2<>\"\",LimitLookup(O$2,PrøverVandret!Regelsæt,5),\"\")","v":""},{"$f":"IF(P$2<>\"\",LimitLookup(P$2,PrøverVandret!Regelsæt,5),\"\")","v":""},{"$f":"IF(Q$2<>\"\",LimitLookup(Q$2,PrøverVandret!Regelsæt,5),\"\")","v":""},{"$f":"IF(R$2<>\"\",LimitLookup(R$2,PrøverVandret!Regelsæt,5),\"\")","v":""},{"$f":"IF(S$2<>\"\",LimitLookup(S$2,PrøverVandret!Regelsæt,5),\"\")","v":""},{"$f":"IF(T$2<>\"\",LimitLookup(T$2,PrøverVandret!Regelsæt,5),\"\")","v":""},{"$f":"IF(U$2<>\"\",LimitLookup(U$2,PrøverVandret!Regelsæt,5),\"\")","v":""},{"$f":"IF(V$2<>\"\",LimitLookup(V$2,PrøverVandret!Regelsæt,5),\"\")","v":""},{"$f":"IF(W$2<>\"\",LimitLookup(W$2,PrøverVandret!Regelsæt,5),\"\")","v":""},{"$f":"IF(X$2<>\"\",LimitLookup(X$2,PrøverVandret!Regelsæt,5),\"\")","v":""},{"$f":"IF(Y$2<>\"\",LimitLookup(Y$2,PrøverVandret!Regelsæt,5),\"\")","v":""},{"$f":"IF(Z$2<>\"\",LimitLookup(Z$2,PrøverVandret!Regelsæt,5),\"\")","v":""},{"$f":"IF(AA$2<>\"\",LimitLookup(AA$2,PrøverVandret!Regelsæt,5),\"\")","v":""},{"$f":"IF(AB$2<>\"\",LimitLookup(AB$2,PrøverVandret!Regelsæt,5),\"\")","v":""},{"$f":"IF(AC$2<>\"\",LimitLookup(AC$2,PrøverVandret!Regelsæt,5),\"\")","v":""},{"$f":"IF(AD$2<>\"\",LimitLookup(AD$2,PrøverVandret!Regelsæt,5),\"\")","v":""},{"$f":"IF(AE$2<>\"\",LimitLookup(AE$2,PrøverVandret!Regelsæt,5),\"\")","v":""},{"$f":"IF(AF$2<>\"\",LimitLookup(AF$2,PrøverVandret!Regelsæt,5),\"\")","v":""},{"$f":"IF(AG$2<>\"\",LimitLookup(AG$2,PrøverVandret!Regelsæt,5),\"\")","v":""},{"$f":"IF(AH$2<>\"\",LimitLookup(AH$2,PrøverVandret!Regelsæt,5),\"\")","v":""},{"$f":"IF(AI$2<>\"\",LimitLookup(AI$2,PrøverVandret!Regelsæt,5),\"\")","v":""},{"$f":"IF(AJ$2<>\"\",LimitLookup(AJ$2,PrøverVandret!Regelsæt,5),\"\")","v":""},{"$f":"IF(AK$2<>\"\",LimitLookup(AK$2,PrøverVandret!Regelsæt,5),\"\")","v":""},{"$f":"IF(AL$2<>\"\",LimitLookup(AL$2,PrøverVandret!Regelsæt,5),\"\")","v":""},{"$f":"IF(AM$2<>\"\",LimitLookup(AM$2,PrøverVandret!Regelsæt,5),\"\")","v":""},{"$f":"IF(AN$2<>\"\",LimitLookup(AN$2,PrøverVandret!Regelsæt,5),\"\")","v":""},{"$f":"IF(AO$2<>\"\",LimitLookup(AO$2,PrøverVandret!Regelsæt,5),\"\")","v":""},{"$f":"IF(AP$2<>\"\",LimitLookup(AP$2,PrøverVandret!Regelsæt,5),\"\")","v":""},{"$f":"IF(AQ$2<>\"\",LimitLookup(AQ$2,PrøverVandret!Regelsæt,5),\"\")","v":""},{"$f":"IF(AR$2<>\"\",LimitLookup(AR$2,PrøverVandret!Regelsæt,5),\"\")","v":""},{"$f":"IF(AS$2<>\"\",LimitLookup(AS$2,PrøverVandret!Regelsæt,5),\"\")","v":""},{"$f":"IF(AT$2<>\"\",LimitLookup(AT$2,PrøverVandret!Regelsæt,5),\"\")","v":""},{"$f":"IF(AU$2<>\"\",LimitLookup(AU$2,PrøverVandret!Regelsæt,5),\"\")","v":""},{"$f":"IF(AV$2<>\"\",LimitLookup(AV$2,PrøverVandret!Regelsæt,5),\"\")","v":""},{"$f":"IF(AW$2<>\"\",LimitLookup(AW$2,PrøverVandret!Regelsæt,5),\"\")","v":""},{"$f":"IF(AX$2<>\"\",LimitLookup(AX$2,PrøverVandret!Regelsæt,5),\"\")","v":""},{"$f":"IF(AY$2<>\"\",LimitLookup(AY$2,PrøverVandret!Regelsæt,5),\"\")","v":""},{"$f":"IF(AZ$2<>\"\",LimitLookup(AZ$2,PrøverVandret!Regelsæt,5),\"\")","v":""},{"$f":"IF(BA$2<>\"\",LimitLookup(BA$2,PrøverVandret!Regelsæt,5),\"\")","v":""},{"$f":"IF(BB$2<>\"\",LimitLookup(BB$2,PrøverVandret!Regelsæt,5),\"\")","v":""},{"$f":"IF(BC$2<>\"\",LimitLookup(BC$2,PrøverVandret!Regelsæt,5),\"\")","v":""},{"$f":"IF(BD$2<>\"\",LimitLookup(BD$2,PrøverVandret!Regelsæt,5),\"\")","v":""},{"$f":"IF(BE$2<>\"\",LimitLookup(BE$2,PrøverVandret!Regelsæt,5),\"\")","v":""},{"$f":"IF(BF$2<>\"\",LimitLookup(BF$2,PrøverVandret!Regelsæt,5),\"\")","v":""},{"$f":"IF(BG$2<>\"\",LimitLookup(BG$2,PrøverVandret!Regelsæt,5),\"\")","v":""},{"$f":"IF(BH$2<>\"\",LimitLookup(BH$2,PrøverVandret!Regelsæt,5),\"\")","v":""},{"$f":"IF(BI$2<>\"\",LimitLookup(BI$2,PrøverVandret!Regelsæt,5),\"\")","v":""},{"$f":"IF(BJ$2<>\"\",LimitLookup(BJ$2,PrøverVandret!Regelsæt,5),\"\")","v":""},{"$f":"IF(BK$2<>\"\",LimitLookup(BK$2,PrøverVandret!Regelsæt,5),\"\")","v":""},{"$f":"IF(BL$2<>\"\",LimitLookup(BL$2,PrøverVandret!Regelsæt,5),\"\")","v":""},{"$f":"IF(BM$2<>\"\",LimitLookup(BM$2,PrøverVandret!Regelsæt,5),\"\")","v":""},{"$f":"IF(BN$2<>\"\",LimitLookup(BN$2,PrøverVandret!Regelsæt,5),\"\")","v":""},{"$f":"IF(BO$2<>\"\",LimitLookup(BO$2,PrøverVandret!Regelsæt,5),\"\")","v":""},{"$f":"IF(BP$2<>\"\",LimitLookup(BP$2,PrøverVandret!Regelsæt,5),\"\")","v":""},{"$f":"IF(BQ$2<>\"\",LimitLookup(BQ$2,PrøverVandret!Regelsæt,5),\"\")","v":""},{"$f":"IF(BR$2<>\"\",LimitLookup(BR$2,PrøverVandret!Regelsæt,5),\"\")","v":""},{"$f":"IF(BS$2<>\"\",LimitLookup(BS$2,PrøverVandret!Regelsæt,5),\"\")","v":""},{"$f":"IF(BT$2<>\"\",LimitLookup(BT$2,PrøverVandret!Regelsæt,5),\"\")","v":""},{"$f":"IF(BU$2<>\"\",LimitLookup(BU$2,PrøverVandret!Regelsæt,5),\"\")","v":""},{"$f":"IF(BV$2<>\"\",LimitLookup(BV$2,PrøverVandret!Regelsæt,5),\"\")","v":""},{"$f":"IF(BW$2<>\"\",LimitLookup(BW$2,PrøverVandret!Regelsæt,5),\"\")","v":""},{"$f":"IF(BX$2<>\"\",LimitLookup(BX$2,PrøverVandret!Regelsæt,5),\"\")","v":""},{"$f":"IF(BY$2<>\"\",LimitLookup(BY$2,PrøverVandret!Regelsæt,5),\"\")","v":""},{"$f":"IF(BZ$2<>\"\",LimitLookup(BZ$2,PrøverVandret!Regelsæt,5),\"\")","v":""},{"$f":"IF(CA$2<>\"\",LimitLookup(CA$2,PrøverVandret!Regelsæt,5),\"\")","v":""},{"$f":"IF(CB$2<>\"\",LimitLookup(CB$2,PrøverVandret!Regelsæt,5),\"\")","v":""},{"$f":"IF(CC$2<>\"\",LimitLookup(CC$2,PrøverVandret!Regelsæt,5),\"\")","v":""},{"$f":"IF(CD$2<>\"\",LimitLookup(CD$2,PrøverVandret!Regelsæt,5),\"\")","v":""},{"$f":"IF(CE$2<>\"\",LimitLookup(CE$2,PrøverVandret!Regelsæt,5),\"\")","v":""},{"$f":"IF(CF$2<>\"\",LimitLookup(CF$2,PrøverVandret!Regelsæt,5),\"\")","v":""},{"$f":"IF(CG$2<>\"\",LimitLookup(CG$2,PrøverVandret!Regelsæt,5),\"\")","v":""},{"$f":"IF(CH$2<>\"\",LimitLookup(CH$2,PrøverVandret!Regelsæt,5),\"\")","v":""},{"$f":"IF(CI$2<>\"\",LimitLookup(CI$2,PrøverVandret!Regelsæt,5),\"\")","v":""},{"$f":"IF(CJ$2<>\"\",LimitLookup(CJ$2,PrøverVandret!Regelsæt,5),\"\")","v":""},{"$f":"IF(CK$2<>\"\",LimitLookup(CK$2,PrøverVandret!Regelsæt,5),\"\")","v":""},{"$f":"IF(CL$2<>\"\",LimitLookup(CL$2,PrøverVandret!Regelsæt,5),\"\")","v":""},{"$f":"IF(CM$2<>\"\",LimitLookup(CM$2,PrøverVandret!Regelsæt,5),\"\")","v":""},{"$f":"IF(CN$2<>\"\",LimitLookup(CN$2,PrøverVandret!Regelsæt,5),\"\")","v":""},{"$f":"IF(CO$2<>\"\",LimitLookup(CO$2,PrøverVandret!Regelsæt,5),\"\")","v":""},{"$f":"IF(CP$2<>\"\",LimitLookup(CP$2,PrøverVandret!Regelsæt,5),\"\")","v":""},{"$f":"IF(CQ$2<>\"\",LimitLookup(CQ$2,PrøverVandret!Regelsæt,5),\"\")","v":""},{"$f":"IF(CR$2<>\"\",LimitLookup(CR$2,PrøverVandret!Regelsæt,5),\"\")","v":""},{"$f":"IF(CS$2<>\"\",LimitLookup(CS$2,PrøverVandret!Regelsæt,5),\"\")","v":""},{"$f":"IF(CT$2<>\"\",LimitLookup(CT$2,PrøverVandret!Regelsæt,5),\"\")","v":""},{"$f":"IF(CU$2<>\"\",LimitLookup(CU$2,PrøverVandret!Regelsæt,5),\"\")","v":""},{"$f":"IF(CV$2<>\"\",LimitLookup(CV$2,PrøverVandret!Regelsæt,5),\"\")","v":""},{"$f":"IF(CW$2<>\"\",LimitLookup(CW$2,PrøverVandret!Regelsæt,5),\"\")","v":""},{"$f":"IF(CX$2<>\"\",LimitLookup(CX$2,PrøverVandret!Regelsæt,5),\"\")","v":""},{"$f":"IF(CY$2<>\"\",LimitLookup(CY$2,PrøverVandret!Regelsæt,5),\"\")","v":""},{"$f":"IF(CZ$2<>\"\",LimitLookup(CZ$2,PrøverVandret!Regelsæt,5),\"\")","v":""},{"$f":"IF(DA$2<>\"\",LimitLookup(DA$2,PrøverVandret!Regelsæt,5),\"\")","v":""}]
[]
[null,"Jordklasse ▼","Prøve- nummer▼","Prøve- mærkning▼",{"$f":"SUBSTITUTE(PrøverVandret!I4,\"►\",\"▼\")","v":""},"Resultater►"]
[null,{"$f":"TRANSPOSE(PrøverVandret!$J$1:$J$4)","v":"Kategori 1"},"862-2024-03666101","-",0,{"$f":"TRANSPOSE(PrøverVandret!$J$5:$J$100)","v":"82"},"11","0,14","11","7,4","6,4","32","2,2","< 5","20","54","20","77","0,03","0,035","0,021","0,014","< 0,01","0,10",0,0,0,0,0,0,0,0,0,0,0,0,0,0,0,0,0,0,0,0,0,0,0,0,0,0,0,0,0,0,0,0,0,0,0,0,0,0,0,0,0,0,0,0,0,0,0,0,0,0,0,0,0,0,0,0,0,0,0,0,0,0,0,0,0,0,0,0,0,0,0,0,0,0,0,0,0]

{"sheet":"PrøverHP14","index":2,"n_rows":116,"n_cols":9,"rows_kept":116,"cut":false,"hidden":true,"merged":[[0,2,0,7]]}
[0,null,"Eurofins fralægger sig ethvert ansvar for anden parts brug af resultater og kategorisering fremkommet ved anvendelsen af denne software.",null,null,null,null,null,"Katego  ►"]
[null,null,null,{"$f":"IF(ProjectData=\"\",\"\",ProjectData)","v":"Kallerup Grusgrav , -, Muldjord"},null,null,null,null,"Prøve-nummer ►"]
["ELIMS","HP14",null,{"$f":"BYGHP14!C2","v":"<"},{"$f":"BYGHP14!D2","v":">="},null,null,null,"Prøve-mærkning ►"]
[{"$f":"DB","v":"Production"},"Parameter▼","Enhed",{"$f":"BYGHP14!C3","v":"Afskæringsværdi H400 og H410"},{"$f":"BYGHP14!D3","v":"Farligt affald"}]
[{"$f":"IF(I5=\"\",\"\",IF($A$3=\"ELIMS\",IF(ISNA(VLOOKUP(I5,Definitioner!$P$2:$S$381,2,FALSE)),\"\",VLOOKUP(I5,Definitioner!$P$2:$S$381,2,FALSE)),VLOOKUP(I5,Definitioner!$O$2:$S$381,3,FALSE)))","v":""},{"$f":"IF(A5<>\"\",VLOOKUP(A5,Definitioner!$A$2:$B$123,2),\"\")","v":""},null,null,{"$f":"IF(LEN(A5),LimitLookup($A5,\"HP14\",2),\"\")","v":""},{"$f":"IF(LEN(A5),LimitLookup($A5,\"HP14\",3),\"\")","v":""},{"$f":"IF(LEN(A5),LimitLookup($A5,\"HP14\",4),\"\")","v":""},{"$f":"IF(LEN(A5),LimitLookup($A5,\"HP14\",5),\"\")","v":""}]
[{"$f":"IF(I6=\"\",\"\",IF($A$3=\"ELIMS\",IF(ISNA(VLOOKUP(I6,Definitioner!$P$2:$S$381,2,FALSE)),\"\",VLOOKUP(I6,Definitioner!$P$2:$S$381,2,FALSE)),VLOOKUP(I6,Definitioner!$O$2:$S$381,3,FALSE)))","v":""},{"$f":"IF(A6<>\"\",VLOOKUP(A6,Definitioner!$A$2:$B$123,2),\"\")","v":""},null,null,{"$f":"IF(LEN(A6),LimitLookup($A6,\"HP14\",2),\"\")","v":""},{"$f":"IF(LEN(A6),LimitLookup($A6,\"HP14\",3),\"\")","v":""},{"$f":"IF(LEN(A6),LimitLookup($A6,\"HP14\",4),\"\")","v":""},{"$f":"IF(LEN(A6),LimitLookup($A6,\"HP14\",5),\"\")","v":""}]
[{"$f":"IF(I7=\"\",\"\",IF($A$3=\"ELIMS\",IF(ISNA(VLOOKUP(I7,Definitioner!$P$2:$S$381,2,FALSE)),\"\",VLOOKUP(I7,Definitioner!$P$2:$S$381,2,FALSE)),VLOOKUP(I7,Definitioner!$O$2:$S$381,3,FALSE)))","v":""},{"$f":"IF(A7<>\"\",VLOOKUP(A7,Definitioner!$A$2:$B$123,2),\"\")","v":""},null,null,{"$f":"IF(LEN(A7),LimitLookup($A7,\"HP14\",2),\"\")","v":""},{"$f":"IF(LEN(A7),LimitLookup($A7,\"HP14\",3),\"\")","v":""},{"$f":"IF(LEN(A7),LimitLookup($A7,\"HP14\",4),\"\")","v":""},{"$f":"IF(LEN(A7),LimitLookup($A7,\"HP14\",5),\"\")","v":""}]
[{"$f":"IF(I8=\"\",\"\",IF($A$3=\"ELIMS\",IF(ISNA(VLOOKUP(I8,Definitioner!$P$2:$S$381,2,FALSE)),\"\",VLOOKUP(I8,Definitioner!$P$2:$S$381,2,FALSE)),VLOOKUP(I8,Definitioner!$O$2:$S$381,3,FALSE)))","v":""},{"$f":"IF(A8<>\"\",VLOOKUP(A8,Definitioner!$A$2:$B$123,2),\"\")","v":""},null,null,{"$f":"IF(LEN(A8),LimitLookup($A8,\"HP14\",2),\"\")","v":""},{"$f":"IF(LEN(A8),LimitLookup($A8,\"HP14\",3),\"\")","v":""},{"$f":"IF(LEN(A8),LimitLookup($A8,\"HP14\",4),\"\")","v":""},{"$f":"IF(LEN(A8),LimitLookup($A8,\"HP14\",5),\"\")","v":""}]
[{"$f":"IF(I9=\"\",\"\",IF($A$3=\"ELIMS\",IF(ISNA(VLOOKUP(I9,Definitioner!$P$2:$S$381,2,FALSE)),\"\",VLOOKUP(I9,Definitioner!$P$2:$S$381,2,FALSE)),VLOOKUP(I9,Definitioner!$O$2:$S$381,3,FALSE)))","v":""},{"$f":"IF(A9<>\"\",VLOOKUP(A9,Definitioner!$A$2:$B$123,2),\"\")","v":""},null,null,{"$f":"IF(LEN(A9),LimitLookup($A9,\"HP14\",2),\"\")","v":""},{"$f":"IF(LEN(A9),LimitLookup($A9,\"HP14\",3),\"\")","v":""},{"$f":"IF(LEN(A9),LimitLookup($A9,\"HP14\",4),\"\")","v":""},{"$f":"IF(LEN(A9),LimitLookup($A9,\"HP14\",5),\"\")","v":""}]
[{"$f":"IF(I10=\"\",\"\",IF($A$3=\"ELIMS\",IF(ISNA(VLOOKUP(I10,Definitioner!$P$2:$S$381,2,FALSE)),\"\",VLOOKUP(I10,Definitioner!$P$2:$S$381,2,FALSE)),VLOOKUP(I10,Definitioner!$O$2:$S$381,3,FALSE)))","v":""},{"$f":"IF(A10<>\"\",VLOOKUP(A10,Definitioner!$A$2:$B$123,2),\"\")","v":""},null,null,{"$f":"IF(LEN(A10),LimitLookup($A10,\"HP14\",2),\"\")","v":""},{"$f":"IF(LEN(A10),LimitLookup($A10,\"HP14\",3),\"\")","v":""},{"$f":"IF(LEN(A10),LimitLookup($A10,\"HP14\",4),\"\")","v":""},{"$f":"IF(LEN(A10),LimitLookup($A10,\"HP14\",5),\"\")","v":""}]
[{"$f":"IF(I11=\"\",\"\",IF($A$3=\"ELIMS\",IF(ISNA(VLOOKUP(I11,Definitioner!$P$2:$S$381,2,FALSE)),\"\",VLOOKUP(I11,Definitioner!$P$2:$S$381,2,FALSE)),VLOOKUP(I11,Definitioner!$O$2:$S$381,3,FALSE)))","v":""},{"$f":"IF(A11<>\"\",VLOOKUP(A11,Definitioner!$A$2:$B$123,2),\"\")","v":""},null,null,{"$f":"IF(LEN(A11),LimitLookup($A11,\"HP14\",2),\"\")","v":""},{"$f":"IF(LEN(A11),LimitLookup($A11,\"HP14\",3),\"\")","v":""},{"$f":"IF(LEN(A11),LimitLookup($A11,\"HP14\",4),\"\")","v":""},{"$f":"IF(LEN(A11),LimitLookup($A11,\"HP14\",5),\"\")","v":""}]
[{"$f":"IF(I12=\"\",\"\",IF($A$3=\"ELIMS\",IF(ISNA(VLOOKUP(I12,Definitioner!$P$2:$S$381,2,FALSE)),\"\",VLOOKUP(I12,Definitioner!$P$2:$S$381,2,FALSE)),VLOOKUP(I12,Definitioner!$O$2:$S$381,3,FALSE)))","v":""},{"$f":"IF(A12<>\"\",VLOOKUP(A12,Definitioner!$A$2:$B$123,2),\"\")","v":""},null,null,{"$f":"IF(LEN(A12),LimitLookup($A12,\"HP14\",2),\"\")","v":""},{"$f":"IF(LEN(A12),LimitLookup($A12,\"HP14\",3),\"\")","v":""},{"$f":"IF(LEN(A12),LimitLookup($A12,\"HP14\",4),\"\")","v":""},{"$f":"IF(LEN(A12),LimitLookup($A12,\"HP14\",5),\"\")","v":""}]
[{"$f":"IF(I13=\"\",\"\",IF($A$3=\"ELIMS\",IF(ISNA(VLOOKUP(I13,Definitioner!$P$2:$S$381,2,FALSE)),\"\",VLOOKUP(I13,Definitioner!$P$2:$S$381,2,FALSE)),VLOOKUP(I13,Definitioner!$O$2:$S$381,3,FALSE)))","v":""},{"$f":"IF(A13<>\"\",VLOOKUP(A13,Definitioner!$A$2:$B$123,2),\"\")","v":""},null,null,{"$f":"IF(LEN(A13),LimitLookup($A13,\"HP14\",2),\"\")","v":""},{"$f":"IF(LEN(A13),LimitLookup($A13,\"HP14\",3),\"\")","v":""},{"$f":"IF(LEN(A13),LimitLookup($A13,\"HP14\",4),\"\")","v":""},{"$f":"IF(LEN(A13),LimitLookup($A13,\"HP14\",5),\"\")","v":""}]
[{"$f":"IF(I14=\"\",\"\",IF($A$3=\"ELIMS\",IF(ISNA(VLOOKUP(I14,Definitioner!$P$2:$S$381,2,FALSE)),\"\",VLOOKUP(I14,Definitioner!$P$2:$S$381,2,FALSE)),VLOOKUP(I14,Definitioner!$O$2:$S$381,3,FALSE)))","v":""},{"$f":"IF(A14<>\"\",VLOOKUP(A14,Definitioner!$A$2:$B$123,2),\"\")","v":""},null,null,{"$f":"IF(LEN(A14),LimitLookup($A14,\"HP14\",2),\"\")","v":""},{"$f":"IF(LEN(A14),LimitLookup($A14,\"HP14\",3),\"\")","v":""},{"$f":"IF(LEN(A14),LimitLookup($A14,\"HP14\",4),\"\")","v":""},{"$f":"IF(LEN(A14),LimitLookup($A14,\"HP14\",5),\"\")","v":""}]
[{"$f":"IF(I15=\"\",\"\",IF($A$3=\"ELIMS\",IF(ISNA(VLOOKUP(I15,Definitioner!$P$2:$S$381,2,FALSE)),\"\",VLOOKUP(I15,Definitioner!$P$2:$S$381,2,FALSE)),VLOOKUP(I15,Definitioner!$O$2:$S$381,3,FALSE)))","v":""},{"$f":"IF(A15<>\"\",VLOOKUP(A15,Definitioner!$A$2:$B$123,2),\"\")","v":""},null,null,{"$f":"IF(LEN(A15),LimitLookup($A15,\"HP14\",2),\"\")","v":""},{"$f":"IF(LEN(A15),LimitLookup($A15,\"HP14\",3),\"\")","v":""},{"$f":"IF(LEN(A15),LimitLookup($A15,\"HP14\",4),\"\")","v":""},{"$f":"IF(LEN(A15),LimitLookup($A15,\"HP14\",5),\"\")","v":""}]
[{"$f":"IF(I16=\"\",\"\",IF($A$3=\"ELIMS\",IF(ISNA(VLOOKUP(I16,Definitioner!$P$2:$S$381,2,FALSE)),\"\",VLOOKUP(I16,Definitioner!$P$2:$S$381,2,FALSE)),VLOOKUP(I16,Definitioner!$O$2:$S$381,3,FALSE)))","v":""},{"$f":"IF(A16<>\"\",VLOOKUP(A16,Definitioner!$A$2:$B$123,2),\"\")","v":""},null,null,{"$f":"IF(LEN(A16),LimitLookup($A16,\"HP14\",2),\"\")","v":""},{"$f":"IF(LEN(A16),LimitLookup($A16,\"HP14\",3),\"\")","v":""},{"$f":"IF(LEN(A16),LimitLookup($A16,\"HP14\",4),\"\")","v":""},{"$f":"IF(LEN(A16),LimitLookup($A16,\"HP14\",5),\"\")","v":""}]
[{"$f":"IF(I17=\"\",\"\",IF($A$3=\"ELIMS\",IF(ISNA(VLOOKUP(I17,Definitioner!$P$2:$S$381,2,FALSE)),\"\",VLOOKUP(I17,Definitioner!$P$2:$S$381,2,FALSE)),VLOOKUP(I17,Definitioner!$O$2:$S$381,3,FALSE)))","v":""},{"$f":"IF(A17<>\"\",VLOOKUP(A17,Definitioner!$A$2:$B$123,2),\"\")","v":""},null,null,{"$f":"IF(LEN(A17),LimitLookup($A17,\"HP14\",2),\"\")","v":""},{"$f":"IF(LEN(A17),LimitLookup($A17,\"HP14\",3),\"\")","v":""},{"$f":"IF(LEN(A17),LimitLookup($A17,\"HP14\",4),\"\")","v":""},{"$f":"IF(LEN(A17),LimitLookup($A17,\"HP14\",5),\"\")","v":""}]
[{"$f":"IF(I18=\"\",\"\",IF($A$3=\"ELIMS\",IF(ISNA(VLOOKUP(I18,Definitioner!$P$2:$S$381,2,FALSE)),\"\",VLOOKUP(I18,Definitioner!$P$2:$S$381,2,FALSE)),VLOOKUP(I18,Definitioner!$O$2:$S$381,3,FALSE)))","v":""},{"$f":"IF(A18<>\"\",VLOOKUP(A18,Definitioner!$A$2:$B$123,2),\"\")","v":""},null,null,{"$f":"IF(LEN(A18),LimitLookup($A18,\"HP14\",2),\"\")","v":""},{"$f":"IF(LEN(A18),LimitLookup($A18,\"HP14\",3),\"\")","v":""},{"$f":"IF(LEN(A18),LimitLookup($A18,\"HP14\",4),\"\")","v":""},{"$f":"IF(LEN(A18),LimitLookup($A18,\"HP14\",5),\"\")","v":""}]
[{"$f":"IF(I19=\"\",\"\",IF($A$3=\"ELIMS\",IF(ISNA(VLOOKUP(I19,Definitioner!$P$2:$S$381,2,FALSE)),\"\",VLOOKUP(I19,Definitioner!$P$2:$S$381,2,FALSE)),VLOOKUP(I19,Definitioner!$O$2:$S$381,3,FALSE)))","v":""},{"$f":"IF(A19<>\"\",VLOOKUP(A19,Definitioner!$A$2:$B$123,2),\"\")","v":""},null,null,{"$f":"IF(LEN(A19),LimitLookup($A19,\"HP14\",2),\"\")","v":""},{"$f":"IF(LEN(A19),LimitLookup($A19,\"HP14\",3),\"\")","v":""},{"$f":"IF(LEN(A19),LimitLookup($A19,\"HP14\",4),\"\")","v":""},{"$f":"IF(LEN(A19),LimitLookup($A19,\"HP14\",5),\"\")","v":""}]
[{"$f":"IF(I20=\"\",\"\",IF($A$3=\"ELIMS\",IF(ISNA(VLOOKUP(I20,Definitioner!$P$2:$S$381,2,FALSE)),\"\",VLOOKUP(I20,Definitioner!$P$2:$S$381,2,FALSE)),VLOOKUP(I20,Definitioner!$O$2:$S$381,3,FALSE)))","v":""},{"$f":"IF(A20<>\"\",VLOOKUP(A20,Definitioner!$A$2:$B$123,2),\"\")","v":""},null,null,{"$f":"IF(LEN(A20),LimitLookup($A20,\"HP14\",2),\"\")","v":""},{"$f":"IF(LEN(A20),LimitLookup($A20,\"HP14\",3),\"\")","v":""},{"$f":"IF(LEN(A20),LimitLookup($A20,\"HP14\",4),\"\")","v":""},{"$f":"IF(LEN(A20),LimitLookup($A20,\"HP14\",5),\"\")","v":""}]
[{"$f":"IF(I21=\"\",\"\",IF($A$3=\"ELIMS\",IF(ISNA(VLOOKUP(I21,Definitioner!$P$2:$S$381,2,FALSE)),\"\",VLOOKUP(I21,Definitioner!$P$2:$S$381,2,FALSE)),VLOOKUP(I21,Definitioner!$O$2:$S$381,3,FALSE)))","v":""},{"$f":"IF(A21<>\"\",VLOOKUP(A21,Definitioner!$A$2:$B$123,2),\"\")","v":""},null,null,{"$f":"IF(LEN(A21),LimitLookup($A21,\"HP14\",2),\"\")","v":""},{"$f":"IF(LEN(A21),LimitLookup($A21,\"HP14\",3),\"\")","v":""},{"$f":"IF(LEN(A21),LimitLookup($A21,\"HP14\",4),\"\")","v":""},{"$f":"IF(LEN(A21),LimitLookup($A21,\"HP14\",5),\"\")","v":""}]
[{"$f":"IF(I22=\"\",\"\",IF($A$3=\"ELIMS\",IF(ISNA(VLOOKUP(I22,Definitioner!$P$2:$S$381,2,FALSE)),\"\",VLOOKUP(I22,Definitioner!$P$2:$S$381,2,FALSE)),VLOOKUP(I22,Definitioner!$O$2:$S$381,3,FALSE)))","v":""},{"$f":"IF(A22<>\"\",VLOOKUP(A22,Definitioner!$A$2:$B$123,2),\"\")","v":""},null,null,{"$f":"IF(LEN(A22),LimitLookup($A22,\"HP14\",2),\"\")","v":""},{"$f":"IF(LEN(A22),LimitLookup($A22,\"HP14\",3),\"\")","v":""},{"$f":"IF(LEN(A22),LimitLookup($A22,\"HP14\",4),\"\")","v":""},{"$f":"IF(LEN(A22),LimitLookup($A22,\"HP14\",5),\"\")","v":""}]
[{"$f":"IF(I23=\"\",\"\",IF($A$3=\"ELIMS\",IF(ISNA(VLOOKUP(I23,Definitioner!$P$2:$S$381,2,FALSE)),\"\",VLOOKUP(I23,Definitioner!$P$2:$S$381,2,FALSE)),VLOOKUP(I23,Definitioner!$O$2:$S$381,3,FALSE)))","v":""},{"$f":"IF(A23<>\"\",VLOOKUP(A23,Definitioner!$A$2:$B$123,2),\"\")","v":""},null,null,{"$f":"IF(LEN(A23),LimitLookup($A23,\"HP14\",2),\"\")","v":""},{"$f":"IF(LEN(A23),LimitLookup($A23,\"HP14\",3),\"\")","v":""},{"$f":"IF(LEN(A23),LimitLookup($A23,\"HP14\",4),\"\")","v":""},{"$f":"IF(LEN(A23),LimitLookup($A23,\"HP14\",5),\"\")","v":""}]
[{"$f":"IF(I24=\"\",\"\",IF($A$3=\"ELIMS\",IF(ISNA(VLOOKUP(I24,Definitioner!$P$2:$S$381,2,FALSE)),\"\",VLOOKUP(I24,Definitioner!$P$2:$S$381,2,FALSE)),VLOOKUP(I24,Definitioner!$O$2:$S$381,3,FALSE)))","v":""},{"$f":"IF(A24<>\"\",VLOOKUP(A24,Definitioner!$A$2:$B$123,2),\"\")","v":""},null,null,{"$f":"IF(LEN(A24),LimitLookup($A24,\"HP14\",2),\"\")","v":""},{"$f":"IF(LEN(A24),LimitLookup($A24,\"HP14\",3),\"\")","v":""},{"$f":"IF(LEN(A24),LimitLookup($A24,\"HP14\",4),\"\")","v":""},{"$f":"IF(LEN(A24),LimitLookup($A24,\"HP14\",5),\"\")","v":""}]
[{"$f":"IF(I25=\"\",\"\",IF($A$3=\"ELIMS\",IF(ISNA(VLOOKUP(I25,Definitioner!$P$2:$S$381,2,FALSE)),\"\",VLOOKUP(I25,Definitioner!$P$2:$S$381,2,FALSE)),VLOOKUP(I25,Definitioner!$O$2:$S$381,3,FALSE)))","v":""},{"$f":"IF(A25<>\"\",VLOOKUP(A25,Definitioner!$A$2:$B$123,2),\"\")","v":""},null,null,{"$f":"IF(LEN(A25),LimitLookup($A25,\"HP14\",2),\"\")","v":""},{"$f":"IF(LEN(A25),LimitLookup($A25,\"HP14\",3),\"\")","v":""},{"$f":"IF(LEN(A25),LimitLookup($A25,\"HP14\",4),\"\")","v":""},{"$f":"IF(LEN(A25),LimitLookup($A25,\"HP14\",5),\"\")","v":""}]
[{"$f":"IF(I26=\"\",\"\",IF($A$3=\"ELIMS\",IF(ISNA(VLOOKUP(I26,Definitioner!$P$2:$S$381,2,FALSE)),\"\",VLOOKUP(I26,Definitioner!$P$2:$S$381,2,FALSE)),VLOOKUP(I26,Definitioner!$O$2:$S$381,3,FALSE)))","v":""},{"$f":"IF(A26<>\"\",VLOOKUP(A26,Definitioner!$A$2:$B$123,2),\"\")","v":""},null,null,{"$f":"IF(LEN(A26),LimitLookup($A26,\"HP14\",2),\"\")","v":""},{"$f":"IF(LEN(A26),LimitLookup($A26,\"HP14\",3),\"\")","v":""},{"$f":"IF(LEN(A26),LimitLookup($A26,\"HP14\",4),\"\")","v":""},{"$f":"IF(LEN(A26),LimitLookup($A26,\"HP14\",5),\"\")","v":""}]
[{"$f":"IF(I27=\"\",\"\",IF($A$3=\"ELIMS\",IF(ISNA(VLOOKUP(I27,Definitioner!$P$2:$S$381,2,FALSE)),\"\",VLOOKUP(I27,Definitioner!$P$2:$S$381,2,FALSE)),VLOOKUP(I27,Definitioner!$O$2:$S$381,3,FALSE)))","v":""},{"$f":"IF(A27<>\"\",VLOOKUP(A27,Definitioner!$A$2:$B$123,2),\"\")","v":""},null,null,{"$f":"IF(LEN(A27),LimitLookup($A27,\"HP14\",2),\"\")","v":""},{"$f":"IF(LEN(A27),LimitLookup($A27,\"HP14\",3),\"\")","v":""},{"$f":"IF(LEN(A27),LimitLookup($A27,\"HP14\",4),\"\")","v":""},{"$f":"IF(LEN(A27),LimitLookup($A27,\"HP14\",5),\"\")","v":""}]
[{"$f":"IF(I28=\"\",\"\",IF($A$3=\"ELIMS\",IF(ISNA(VLOOKUP(I28,Definitioner!$P$2:$S$381,2,FALSE)),\"\",VLOOKUP(I28,Definitioner!$P$2:$S$381,2,FALSE)),VLOOKUP(I28,Definitioner!$O$2:$S$381,3,FALSE)))","v":""},{"$f":"IF(A28<>\"\",VLOOKUP(A28,Definitioner!$A$2:$B$123,2),\"\")","v":""},null,null,{"$f":"IF(LEN(A28),LimitLookup($A28,\"HP14\",2),\"\")","v":""},{"$f":"IF(LEN(A28),LimitLookup($A28,\"HP14\",3),\"\")","v":""},{"$f":"IF(LEN(A28),LimitLookup($A28,\"HP14\",4),\"\")","v":""},{"$f":"IF(LEN(A28),LimitLookup($A28,\"HP14\",5),\"\")","v":""}]
[{"$f":"IF(I29=\"\",\"\",IF($A$3=\"ELIMS\",IF(ISNA(VLOOKUP(I29,Definitioner!$P$2:$S$381,2,FALSE)),\"\",VLOOKUP(I29,Definitioner!$P$2:$S$381,2,FALSE)),VLOOKUP(I29,Definitioner!$O$2:$S$381,3,FALSE)))","v":""},{"$f":"IF(A29<>\"\",VLOOKUP(A29,Definitioner!$A$2:$B$123,2),\"\")","v":""},null,null,{"$f":"IF(LEN(A29),LimitLookup($A29,\"HP14\",2),\"\")","v":""},{"$f":"IF(LEN(A29),LimitLookup($A29,\"HP14\",3),\"\")","v":""},{"$f":"IF(LEN(A29),LimitLookup($A29,\"HP14\",4),\"\")","v":""},{"$f":"IF(LEN(A29),LimitLookup($A29,\"HP14\",5),\"\")","v":""}]
[{"$f":"IF(I30=\"\",\"\",IF($A$3=\"ELIMS\",IF(ISNA(VLOOKUP(I30,Definitioner!$P$2:$S$381,2,FALSE)),\"\",VLOOKUP(I30,Definitioner!$P$2:$S$381,2,FALSE)),VLOOKUP(I30,Definitioner!$O$2:$S$381,3,FALSE)))","v":""},{"$f":"IF(A30<>\"\",VLOOKUP(A30,Definitioner!$A$2:$B$123,2),\"\")","v":""},null,null,{"$f":"IF(LEN(A30),LimitLookup($A30,\"HP14\",2),\"\")","v":""},{"$f":"IF(LEN(A30),LimitLookup($A30,\"HP14\",3),\"\")","v":""},{"$f":"IF(LEN(A30),LimitLookup($A30,\"HP14\",4),\"\")","v":""},{"$f":"IF(LEN(A30),LimitLookup($A30,\"HP14\",5),\"\")","v":""}]
[{"$f":"IF(I31=\"\",\"\",IF($A$3=\"ELIMS\",IF(ISNA(VLOOKUP(I31,Definitioner!$P$2:$S$381,2,FALSE)),\"\",VLOOKUP(I31,Definitioner!$P$2:$S$381,2,FALSE)),VLOOKUP(I31,Definitioner!$O$2:$S$381,3,FALSE)))","v":""},{"$f":"IF(A31<>\"\",VLOOKUP(A31,Definitioner!$A$2:$B$123,2),\"\")","v":""},null,null,{"$f":"IF(LEN(A31),LimitLookup($A31,\"HP14\",2),\"\")","v":""},{"$f":"IF(LEN(A31),LimitLookup($A31,\"HP14\",3),\"\")","v":""},{"$f":"IF(LEN(A31),LimitLookup($A31,\"HP14\",4),\"\")","v":""},{"$f":"IF(LEN(A31),LimitLookup($A31,\"HP14\",5),\"\")","v":""}]
[{"$f":"IF(I32=\"\",\"\",IF($A$3=\"ELIMS\",IF(ISNA(VLOOKUP(I32,Definitioner!$P$2:$S$381,2,FALSE)),\"\",VLOOKUP(I32,Definitioner!$P$2:$S$381,2,FALSE)),VLOOKUP(I32,Definitioner!$O$2:$S$381,3,FALSE)))","v":""},{"$f":"IF(A32<>\"\",VLOOKUP(A32,Definitioner!$A$2:$B$123,2),\"\")","v":""},null,null,{"$f":"IF(LEN(A32),LimitLookup($A32,\"HP14\",2),\"\")","v":""},{"$f":"IF(LEN(A32),LimitLookup($A32,\"HP14\",3),\"\")","v":""},{"$f":"IF(LEN(A32),LimitLookup($A32,\"HP14\",4),\"\")","v":""},{"$f":"IF(LEN(A32),LimitLookup($A32,\"HP14\",5),\"\")","v":""}]
[{"$f":"IF(I33=\"\",\"\",IF($A$3=\"ELIMS\",IF(ISNA(VLOOKUP(I33,Definitioner!$P$2:$S$381,2,FALSE)),\"\",VLOOKUP(I33,Definitioner!$P$2:$S$381,2,FALSE)),VLOOKUP(I33,Definitioner!$O$2:$S$381,3,FALSE)))","v":""},{"$f":"IF(A33<>\"\",VLOOKUP(A33,Definitioner!$A$2:$B$123,2),\"\")","v":""},null,null,{"$f":"IF(LEN(A33),LimitLookup($A33,\"HP14\",2),\"\")","v":""},{"$f":"IF(LEN(A33),LimitLookup($A33,\"HP14\",3),\"\")","v":""},{"$f":"IF(LEN(A33),LimitLookup($A33,\"HP14\",4),\"\")","v":""},{"$f":"IF(LEN(A33),LimitLookup($A33,\"HP14\",5),\"\")","v":""}]
[{"$f":"IF(I34=\"\",\"\",IF($A$3=\"ELIMS\",IF(ISNA(VLOOKUP(I34,Definitioner!$P$2:$S$381,2,FALSE)),\"\",VLOOKUP(I34,Definitioner!$P$2:$S$381,2,FALSE)),VLOOKUP(I34,Definitioner!$O$2:$S$381,3,FALSE)))","v":""},{"$f":"IF(A34<>\"\",VLOOKUP(A34,Definitioner!$A$2:$B$123,2),\"\")","v":""},null,null,{"$f":"IF(LEN(A34),LimitLookup($A34,\"HP14\",2),\"\")","v":""},{"$f":"IF(LEN(A34),LimitLookup($A34,\"HP14\",3),\"\")","v":""},{"$f":"IF(LEN(A34),LimitLookup($A34,\"HP14\",4),\"\")","v":""},{"$f":"IF(LEN(A34),LimitLookup($A34,\"HP14\",5),\"\")","v":""}]
[{"$f":"IF(I35=\"\",\"\",IF($A$3=\"ELIMS\",IF(ISNA(VLOOKUP(I35,Definitioner!$P$2:$S$381,2,FALSE)),\"\",VLOOKUP(I35,Definitioner!$P$2:$S$381,2,FALSE)),VLOOKUP(I35,Definitioner!$O$2:$S$381,3,FALSE)))","v":""},{"$f":"IF(A35<>\"\",VLOOKUP(A35,Definitioner!$A$2:$B$123,2),\"\")","v":""},null,null,{"$f":"IF(LEN(A35),LimitLookup($A35,\"HP14\",2),\"\")","v":""},{"$f":"IF(LEN(A35),LimitLookup($A35,\"HP14\",3),\"\")","v":""},{"$f":"IF(LEN(A35),LimitLookup($A35,\"HP14\",4),\"\")","v":""},{"$f":"IF(LEN(A35),LimitLookup($A35,\"HP14\",5),\"\")","v":""}]
[{"$f":"IF(I36=\"\",\"\",IF($A$3=\"ELIMS\",IF(ISNA(VLOOKUP(I36,Definitioner!$P$2:$S$381,2,FALSE)),\"\",VLOOKUP(I36,Definitioner!$P$2:$S$381,2,FALSE)),VLOOKUP(I36,Definitioner!$O$2:$S$381,3,FALSE)))","v":""},{"$f":"IF(A36<>\"\",VLOOKUP(A36,Definitioner!$A$2:$B$123,2),\"\")","v":""},null,null,{"$f":"IF(LEN(A36),LimitLookup($A36,\"HP14\",2),\"\")","v":""},{"$f":"IF(LEN(A36),LimitLookup($A36,\"HP14\",3),\"\")","v":""},{"$f":"IF(LEN(A36),LimitLookup($A36,\"HP14\",4),\"\")","v":""},{"$f":"IF(LEN(A36),LimitLookup($A36,\"HP14\",5),\"\")","v":""}]
[{"$f":"IF(I37=\"\",\"\",IF($A$3=\"ELIMS\",IF(ISNA(VLOOKUP(I37,Definitioner!$P$2:$S$381,2,FALSE)),\"\",VLOOKUP(I37,Definitioner!$P$2:$S$381,2,FALSE)),VLOOKUP(I37,Definitioner!$O$2:$S$381,3,FALSE)))","v":""},{"$f":"IF(A37<>\"\",VLOOKUP(A37,Definitioner!$A$2:$B$123,2),\"\")","v":""},null,null,{"$f":"IF(LEN(A37),LimitLookup($A37,\"HP14\",2),\"\")","v":""},{"$f":"IF(LEN(A37),LimitLookup($A37,\"HP14\",3),\"\")","v":""},{"$f":"IF(LEN(A37),LimitLookup($A37,\"HP14\",4),\"\")","v":""},{"$f":"IF(LEN(A37),LimitLookup($A37,\"HP14\",5),\"\")","v":""}]
[{"$f":"IF(I38=\"\",\"\",IF($A$3=\"ELIMS\",IF(ISNA(VLOOKUP(I38,Definitioner!$P$2:$S$381,2,FALSE)),\"\",VLOOKUP(I38,Definitioner!$P$2:$S$381,2,FALSE)),VLOOKUP(I38,Definitioner!$O$2:$S$381,3,FALSE)))","v":""},{"$f":"IF(A38<>\"\",VLOOKUP(A38,Definitioner!$A$2:$B$123,2),\"\")","v":""},null,null,{"$f":"IF(LEN(A38),LimitLookup($A38,\"HP14\",2),\"\")","v":""},{"$f":"IF(LEN(A38),LimitLookup($A38,\"HP14\",3),\"\")","v":""},{"$f":"IF(LEN(A38),LimitLookup($A38,\"HP14\",4),\"\")","v":""},{"$f":"IF(LEN(A38),LimitLookup($A38,\"HP14\",5),\"\")","v":""}]
[{"$f":"IF(I39=\"\",\"\",IF($A$3=\"ELIMS\",IF(ISNA(VLOOKUP(I39,Definitioner!$P$2:$S$381,2,FALSE)),\"\",VLOOKUP(I39,Definitioner!$P$2:$S$381,2,FALSE)),VLOOKUP(I39,Definitioner!$O$2:$S$381,3,FALSE)))","v":""},{"$f":"IF(A39<>\"\",VLOOKUP(A39,Definitioner!$A$2:$B$123,2),\"\")","v":""},null,null,{"$f":"IF(LEN(A39),LimitLookup($A39,\"HP14\",2),\"\")","v":""},{"$f":"IF(LEN(A39),LimitLookup($A39,\"HP14\",3),\"\")","v":""},{"$f":"IF(LEN(A39),LimitLookup($A39,\"HP14\",4),\"\")","v":""},{"$f":"IF(LEN(A39),LimitLookup($A39,\"HP14\",5),\"\")","v":""}]
[{"$f":"IF(I40=\"\",\"\",IF($A$3=\"ELIMS\",IF(ISNA(VLOOKUP(I40,Definitioner!$P$2:$S$381,2,FALSE)),\"\",VLOOKUP(I40,Definitioner!$P$2:$S$381,2,FALSE)),VLOOKUP(I40,Definitioner!$O$2:$S$381,3,FALSE)))","v":""},{"$f":"IF(A40<>\"\",VLOOKUP(A40,Definitioner!$A$2:$B$123,2),\"\")","v":""},null,null,{"$f":"IF(LEN(A40),LimitLookup($A40,\"HP14\",2),\"\")","v":""},{"$f":"IF(LEN(A40),LimitLookup($A40,\"HP14\",3),\"\")","v":""},{"$f":"IF(LEN(A40),LimitLookup($A40,\"HP14\",4),\"\")","v":""},{"$f":"IF(LEN(A40),LimitLookup($A40,\"HP14\",5),\"\")","v":""}]
[{"$f":"IF(I41=\"\",\"\",IF($A$3=\"ELIMS\",IF(ISNA(VLOOKUP(I41,Definitioner!$P$2:$S$381,2,FALSE)),\"\",VLOOKUP(I41,Definitioner!$P$2:$S$381,2,FALSE)),VLOOKUP(I41,Definitioner!$O$2:$S$381,3,FALSE)))","v":""},{"$f":"IF(A41<>\"\",VLOOKUP(A41,Definitioner!$A$2:$B$123,2),\"\")","v":""},null,null,{"$f":"IF(LEN(A41),LimitLookup($A41,\"HP14\",2),\"\")","v":""},{"$f":"IF(LEN(A41),LimitLookup($A41,\"HP14\",3),\"\")","v":""},{"$f":"IF(LEN(A41),LimitLookup($A41,\"HP14\",4),\"\")","v":""},{"$f":"IF(LEN(A41),LimitLookup($A41,\"HP14\",5),\"\")","v":""}]
[{"$f":"IF(I42=\"\",\"\",IF($A$3=\"ELIMS\",IF(ISNA(VLOOKUP(I42,Definitioner!$P$2:$S$381,2,FALSE)),\"\",VLOOKUP(I42,Definitioner!$P$2:$S$381,2,FALSE)),VLOOKUP(I42,Definitioner!$O$2:$S$381,3,FALSE)))","v":""},{"$f":"IF(A42<>\"\",VLOOKUP(A42,Definitioner!$A$2:$B$123,2),\"\")","v":""},null,null,{"$f":"IF(LEN(A42),LimitLookup($A42,\"HP14\",2),\"\")","v":""},{"$f":"IF(LEN(A42),LimitLookup($A42,\"HP14\",3),\"\")","v":""},{"$f":"IF(LEN(A42),LimitLookup($A42,\"HP14\",4),\"\")","v":""},{"$f":"IF(LEN(A42),LimitLookup($A42,\"HP14\",5),\"\")","v":""}]
[{"$f":"IF(I43=\"\",\"\",IF($A$3=\"ELIMS\",IF(ISNA(VLOOKUP(I43,Definitioner!$P$2:$S$381,2,FALSE)),\"\",VLOOKUP(I43,Definitioner!$P$2:$S$381,2,FALSE)),VLOOKUP(I43,Definitioner!$O$2:$S$381,3,FALSE)))","v":""},{"$f":"IF(A43<>\"\",VLOOKUP(A43,Definitioner!$A$2:$B$123,2),\"\")","v":""},null,null,{"$f":"IF(LEN(A43),LimitLookup($A43,\"HP14\",2),\"\")","v":""},{"$f":"IF(LEN(A43),LimitLookup($A43,\"HP14\",3),\"\")","v":""},{"$f":"IF(LEN(A43),LimitLookup($A43,\"HP14\",4),\"\")","v":""},{"$f":"IF(LEN(A43),LimitLookup($A43,\"HP14\",5),\"\")","v":""}]
[{"$f":"IF(I44=\"\",\"\",IF($A$3=\"ELIMS\",IF(ISNA(VLOOKUP(I44,Definitioner!$P$2:$S$381,2,FALSE)),\"\",VLOOKUP(I44,Definitioner!$P$2:$S$381,2,FALSE)),VLOOKUP(I44,Definitioner!$O$2:$S$381,3,FALSE)))","v":""},{"$f":"IF(A44<>\"\",VLOOKUP(A44,Definitioner!$A$2:$B$123,2),\"\")","v":""},null,null,{"$f":"IF(LEN(A44),LimitLookup($A44,\"HP14\",2),\"\")","v":""},{"$f":"IF(LEN(A44),LimitLookup($A44,\"HP14\",3),\"\")","v":""},{"$f":"IF(LEN(A44),LimitLookup($A44,\"HP14\",4),\"\")","v":""},{"$f":"IF(LEN(A44),LimitLookup($A44,\"HP14\",5),\"\")","v":""}]
[{"$f":"IF(I45=\"\",\"\",IF($A$3=\"ELIMS\",IF(ISNA(VLOOKUP(I45,Definitioner!$P$2:$S$381,2,FALSE)),\"\",VLOOKUP(I45,Definitioner!$P$2:$S$381,2,FALSE)),VLOOKUP(I45,Definitioner!$O$2:$S$381,3,FALSE)))","v":""},{"$f":"IF(A45<>\"\",VLOOKUP(A45,Definitioner!$A$2:$B$123,2),\"\")","v":""},null,null,{"$f":"IF(LEN(A45),LimitLookup($A45,\"HP14\",2),\"\")","v":""},{"$f":"IF(LEN(A45),LimitLookup($A45,\"HP14\",3),\"\")","v":""},{"$f":"IF(LEN(A45),LimitLookup($A45,\"HP14\",4),\"\")","v":""},{"$f":"IF(LEN(A45),LimitLookup($A45,\"HP14\",5),\"\")","v":""}]
[{"$f":"IF(I46=\"\",\"\",IF($A$3=\"ELIMS\",IF(ISNA(VLOOKUP(I46,Definitioner!$P$2:$S$381,2,FALSE)),\"\",VLOOKUP(I46,Definitioner!$P$2:$S$381,2,FALSE)),VLOOKUP(I46,Definitioner!$O$2:$S$381,3,FALSE)))","v":""},{"$f":"IF(A46<>\"\",VLOOKUP(A46,Definitioner!$A$2:$B$123,2),\"\")","v":""},null,null,{"$f":"IF(LEN(A46),LimitLookup($A46,\"HP14\",2),\"\")","v":""},{"$f":"IF(LEN(A46),LimitLookup($A46,\"HP14\",3),\"\")","v":""},{"$f":"IF(LEN(A46),LimitLookup($A46,\"HP14\",4),\"\")","v":""},{"$f":"IF(LEN(A46),LimitLookup($A46,\"HP14\",5),\"\")","v":""}]
[{"$f":"IF(I47=\"\",\"\",IF($A$3=\"ELIMS\",IF(ISNA(VLOOKUP(I47,Definitioner!$P$2:$S$381,2,FALSE)),\"\",VLOOKUP(I47,Definitioner!$P$2:$S$381,2,FALSE)),VLOOKUP(I47,Definitioner!$O$2:$S$381,3,FALSE)))","v":""},{"$f":"IF(A47<>\"\",VLOOKUP(A47,Definitioner!$A$2:$B$123,2),\"\")","v":""},null,null,{"$f":"IF(LEN(A47),LimitLookup($A47,\"HP14\",2),\"\")","v":""},{"$f":"IF(LEN(A47),LimitLookup($A47,\"HP14\",3),\"\")","v":""},{"$f":"IF(LEN(A47),LimitLookup($A47,\"HP14\",4),\"\")","v":""},{"$f":"IF(LEN(A47),LimitLookup($A47,\"HP14\",5),\"\")","v":""}]
[{"$f":"IF(I48=\"\",\"\",IF($A$3=\"ELIMS\",IF(ISNA(VLOOKUP(I48,Definitioner!$P$2:$S$381,2,FALSE)),\"\",VLOOKUP(I48,Definitioner!$P$2:$S$381,2,FALSE)),VLOOKUP(I48,Definitioner!$O$2:$S$381,3,FALSE)))","v":""},{"$f":"IF(A48<>\"\",VLOOKUP(A48,Definitioner!$A$2:$B$123,2),\"\")","v":""},null,null,{"$f":"IF(LEN(A48),LimitLookup($A48,\"HP14\",2),\"\")","v":""},{"$f":"IF(LEN(A48),LimitLookup($A48,\"HP14\",3),\"\")","v":""},{"$f":"IF(LEN(A48),LimitLookup($A48,\"HP14\",4),\"\")","v":""},{"$f":"IF(LEN(A48),LimitLookup($A48,\"HP14\",5),\"\")","v":""}]
[{"$f":"IF(I49=\"\",\"\",IF($A$3=\"ELIMS\",IF(ISNA(VLOOKUP(I49,Definitioner!$P$2:$S$381,2,FALSE)),\"\",VLOOKUP(I49,Definitioner!$P$2:$S$381,2,FALSE)),VLOOKUP(I49,Definitioner!$O$2:$S$381,3,FALSE)))","v":""},{"$f":"IF(A49<>\"\",VLOOKUP(A49,Definitioner!$A$2:$B$123,2),\"\")","v":""},null,null,{"$f":"IF(LEN(A49),LimitLookup($A49,\"HP14\",2),\"\")","v":""},{"$f":"IF(LEN(A49),LimitLookup($A49,\"HP14\",3),\"\")","v":""},{"$f":"IF(LEN(A49),LimitLookup($A49,\"HP14\",4),\"\")","v":""},{"$f":"IF(LEN(A49),LimitLookup($A49,\"HP14\",5),\"\")","v":""}]
[{"$f":"IF(I50=\"\",\"\",IF($A$3=\"ELIMS\",IF(ISNA(VLOOKUP(I50,Definitioner!$P$2:$S$381,2,FALSE)),\"\",VLOOKUP(I50,Definitioner!$P$2:$S$381,2,FALSE)),VLOOKUP(I50,Definitioner!$O$2:$S$381,3,FALSE)))","v":""},{"$f":"IF(A50<>\"\",VLOOKUP(A50,Definitioner!$A$2:$B$123,2),\"\")","v":""},null,null,{"$f":"IF(LEN(A50),LimitLookup($A50,\"HP14\",2),\"\")","v":""},{"$f":"IF(LEN(A50),LimitLookup($A50,\"HP14\",3),\"\")","v":""},{"$f":"IF(LEN(A50),LimitLookup($A50,\"HP14\",4),\"\")","v":""},{"$f":"IF(LEN(A50),LimitLookup($A50,\"HP14\",5),\"\")","v":""}]
[{"$f":"IF(I51=\"\",\"\",IF($A$3=\"ELIMS\",IF(ISNA(VLOOKUP(I51,Definitioner!$P$2:$S$381,2,FALSE)),\"\",VLOOKUP(I51,Definitioner!$P$2:$S$381,2,FALSE)),VLOOKUP(I51,Definitioner!$O$2:$S$381,3,FALSE)))","v":""},{"$f":"IF(A51<>\"\",VLOOKUP(A51,Definitioner!$A$2:$B$123,2),\"\")","v":""},null,null,{"$f":"IF(LEN(A51),LimitLookup($A51,\"HP14\",2),\"\")","v":""},{"$f":"IF(LEN(A51),LimitLookup($A51,\"HP14\",3),\"\")","v":""},{"$f":"IF(LEN(A51),LimitLookup($A51,\"HP14\",4),\"\")","v":""},{"$f":"IF(LEN(A51),LimitLookup($A51,\"HP14\",5),\"\")","v":""}]
[{"$f":"IF(I52=\"\",\"\",IF($A$3=\"ELIMS\",IF(ISNA(VLOOKUP(I52,Definitioner!$P$2:$S$381,2,FALSE)),\"\",VLOOKUP(I52,Definitioner!$P$2:$S$381,2,FALSE)),VLOOKUP(I52,Definitioner!$O$2:$S$381,3,FALSE)))","v":""},{"$f":"IF(A52<>\"\",VLOOKUP(A52,Definitioner!$A$2:$B$123,2),\"\")","v":""},null,null,{"$f":"IF(LEN(A52),LimitLookup($A52,\"HP14\",2),\"\")","v":""},{"$f":"IF(LEN(A52),LimitLookup($A52,\"HP14\",3),\"\")","v":""},{"$f":"IF(LEN(A52),LimitLookup($A52,\"HP14\",4),\"\")","v":""},{"$f":"IF(LEN(A52),LimitLookup($A52,\"HP14\",5),\"\")","v":""}]
[{"$f":"IF(I53=\"\",\"\",IF($A$3=\"ELIMS\",IF(ISNA(VLOOKUP(I53,Definitioner!$P$2:$S$381,2,FALSE)),\"\",VLOOKUP(I53,Definitioner!$P$2:$S$381,2,FALSE)),VLOOKUP(I53,Definitioner!$O$2:$S$381,3,FALSE)))","v":""},{"$f":"IF(A53<>\"\",VLOOKUP(A53,Definitioner!$A$2:$B$123,2),\"\")","v":""},null,null,{"$f":"IF(LEN(A53),LimitLookup($A53,\"HP14\",2),\"\")","v":""},{"$f":"IF(LEN(A53),LimitLookup($A53,\"HP14\",3),\"\")","v":""},{"$f":"IF(LEN(A53),LimitLookup($A53,\"HP14\",4),\"\")","v":""},{"$f":"IF(LEN(A53),LimitLookup($A53,\"HP14\",5),\"\")","v":""}]
[{"$f":"IF(I54=\"\",\"\",IF($A$3=\"ELIMS\",IF(ISNA(VLOOKUP(I54,Definitioner!$P$2:$S$381,2,FALSE)),\"\",VLOOKUP(I54,Definitioner!$P$2:$S$381,2,FALSE)),VLOOKUP(I54,Definitioner!$O$2:$S$381,3,FALSE)))","v":""},{"$f":"IF(A54<>\"\",VLOOKUP(A54,Definitioner!$A$2:$B$123,2),\"\")","v":""},null,null,{"$f":"IF(LEN(A54),LimitLookup($A54,\"HP14\",2),\"\")","v":""},{"$f":"IF(LEN(A54),LimitLookup($A54,\"HP14\",3),\"\")","v":""},{"$f":"IF(LEN(A54),LimitLookup($A54,\"HP14\",4),\"\")","v":""},{"$f":"IF(LEN(A54),LimitLookup($A54,\"HP14\",5),\"\")","v":""}]
[{"$f":"IF(I55=\"\",\"\",IF($A$3=\"ELIMS\",IF(ISNA(VLOOKUP(I55,Definitioner!$P$2:$S$381,2,FALSE)),\"\",VLOOKUP(I55,Definitioner!$P$2:$S$381,2,FALSE)),VLOOKUP(I55,Definitioner!$O$2:$S$381,3,FALSE)))","v":""},{"$f":"IF(A55<>\"\",VLOOKUP(A55,Definitioner!$A$2:$B$123,2),\"\")","v":""},null,null,{"$f":"IF(LEN(A55),LimitLookup($A55,\"HP14\",2),\"\")","v":""},{"$f":"IF(LEN(A55),LimitLookup($A55,\"HP14\",3),\"\")","v":""},{"$f":"IF(LEN(A55),LimitLookup($A55,\"HP14\",4),\"\")","v":""},{"$f":"IF(LEN(A55),LimitLookup($A55,\"HP14\",5),\"\")","v":""}]
[{"$f":"IF(I56=\"\",\"\",IF($A$3=\"ELIMS\",IF(ISNA(VLOOKUP(I56,Definitioner!$P$2:$S$381,2,FALSE)),\"\",VLOOKUP(I56,Definitioner!$P$2:$S$381,2,FALSE)),VLOOKUP(I56,Definitioner!$O$2:$S$381,3,FALSE)))","v":""},{"$f":"IF(A56<>\"\",VLOOKUP(A56,Definitioner!$A$2:$B$123,2),\"\")","v":""},null,null,{"$f":"IF(LEN(A56),LimitLookup($A56,\"HP14\",2),\"\")","v":""},{"$f":"IF(LEN(A56),LimitLookup($A56,\"HP14\",3),\"\")","v":""},{"$f":"IF(LEN(A56),LimitLookup($A56,\"HP14\",4),\"\")","v":""},{"$f":"IF(LEN(A56),LimitLookup($A56,\"HP14\",5),\"\")","v":""}]
[{"$f":"IF(I57=\"\",\"\",IF($A$3=\"ELIMS\",IF(ISNA(VLOOKUP(I57,Definitioner!$P$2:$S$381,2,FALSE)),\"\",VLOOKUP(I57,Definitioner!$P$2:$S$381,2,FALSE)),VLOOKUP(I57,Definitioner!$O$2:$S$381,3,FALSE)))","v":""},{"$f":"IF(A57<>\"\",VLOOKUP(A57,Definitioner!$A$2:$B$123,2),\"\")","v":""},null,null,{"$f":"IF(LEN(A57),LimitLookup($A57,\"HP14\",2),\"\")","v":""},{"$f":"IF(LEN(A57),LimitLookup($A57,\"HP14\",3),\"\")","v":""},{"$f":"IF(LEN(A57),LimitLookup($A57,\"HP14\",4),\"\")","v":""},{"$f":"IF(LEN(A57),LimitLookup($A57,\"HP14\",5),\"\")","v":""}]
[{"$f":"IF(I58=\"\",\"\",IF($A$3=\"ELIMS\",IF(ISNA(VLOOKUP(I58,Definitioner!$P$2:$S$381,2,FALSE)),\"\",VLOOKUP(I58,Definitioner!$P$2:$S$381,2,FALSE)),VLOOKUP(I58,Definitioner!$O$2:$S$381,3,FALSE)))","v":""},{"$f":"IF(A58<>\"\",VLOOKUP(A58,Definitioner!$A$2:$B$123,2),\"\")","v":""},null,null,{"$f":"IF(LEN(A58),LimitLookup($A58,\"HP14\",2),\"\")","v":""},{"$f":"IF(LEN(A58),LimitLookup($A58,\"HP14\",3),\"\")","v":""},{"$f":"IF(LEN(A58),LimitLookup($A58,\"HP14\",4),\"\")","v":""},{"$f":"IF(LEN(A58),LimitLookup($A58,\"HP14\",5),\"\")","v":""}]
[{"$f":"IF(I59=\"\",\"\",IF($A$3=\"ELIMS\",IF(ISNA(VLOOKUP(I59,Definitioner!$P$2:$S$381,2,FALSE)),\"\",VLOOKUP(I59,Definitioner!$P$2:$S$381,2,FALSE)),VLOOKUP(I59,Definitioner!$O$2:$S$381,3,FALSE)))","v":""},{"$f":"IF(A59<>\"\",VLOOKUP(A59,Definitioner!$A$2:$B$123,2),\"\")","v":""},null,null,{"$f":"IF(LEN(A59),LimitLookup($A59,\"HP14\",2),\"\")","v":""},{"$f":"IF(LEN(A59),LimitLookup($A59,\"HP14\",3),\"\")","v":""},{"$f":"IF(LEN(A59),LimitLookup($A59,\"HP14\",4),\"\")","v":""},{"$f":"IF(LEN(A59),LimitLookup($A59,\"HP14\",5),\"\")","v":""}]
[{"$f":"IF(I60=\"\",\"\",IF($A$3=\"ELIMS\",IF(ISNA(VLOOKUP(I60,Definitioner!$P$2:$S$381,2,FALSE)),\"\",VLOOKUP(I60,Definitioner!$P$2:$S$381,2,FALSE)),VLOOKUP(I60,Definitioner!$O$2:$S$381,3,FALSE)))","v":""},{"$f":"IF(A60<>\"\",VLOOKUP(A60,Definitioner!$A$2:$B$123,2),\"\")","v":""},null,null,{"$f":"IF(LEN(A60),LimitLookup($A60,\"HP14\",2),\"\")","v":""},{"$f":"IF(LEN(A60),LimitLookup($A60,\"HP14\",3),\"\")","v":""},{"$f":"IF(LEN(A60),LimitLookup($A60,\"HP14\",4),\"\")","v":""},{"$f":"IF(LEN(A60),LimitLookup($A60,\"HP14\",5),\"\")","v":""}]
[{"$f":"IF(I61=\"\",\"\",IF($A$3=\"ELIMS\",IF(ISNA(VLOOKUP(I61,Definitioner!$P$2:$S$381,2,FALSE)),\"\",VLOOKUP(I61,Definitioner!$P$2:$S$381,2,FALSE)),VLOOKUP(I61,Definitioner!$O$2:$S$381,3,FALSE)))","v":""},{"$f":"IF(A61<>\"\",VLOOKUP(A61,Definitioner!$A$2:$B$123,2),\"\")","v":""},null,null,{"$f":"IF(LEN(A61),LimitLookup($A61,\"HP14\",2),\"\")","v":""},{"$f":"IF(LEN(A61),LimitLookup($A61,\"HP14\",3),\"\")","v":""},{"$f":"IF(LEN(A61),LimitLookup($A61,\"HP14\",4),\"\")","v":""},{"$f":"IF(LEN(A61),LimitLookup($A61,\"HP14\",5),\"\")","v":""}]
[{"$f":"IF(I62=\"\",\"\",IF($A$3=\"ELIMS\",IF(ISNA(VLOOKUP(I62,Definitioner!$P$2:$S$381,2,FALSE)),\"\",VLOOKUP(I62,Definitioner!$P$2:$S$381,2,FALSE)),VLOOKUP(I62,Definitioner!$O$2:$S$381,3,FALSE)))","v":""},{"$f":"IF(A62<>\"\",VLOOKUP(A62,Definitioner!$A$2:$B$123,2),\"\")","v":""},null,null,{"$f":"IF(LEN(A62),LimitLookup($A62,\"HP14\",2),\"\")","v":""},{"$f":"IF(LEN(A62),LimitLookup($A62,\"HP14\",3),\"\")","v":""},{"$f":"IF(LEN(A62),LimitLookup($A62,\"HP14\",4),\"\")","v":""},{"$f":"IF(LEN(A62),LimitLookup($A62,\"HP14\",5),\"\")","v":""}]
[{"$f":"IF(I63=\"\",\"\",IF($A$3=\"ELIMS\",IF(ISNA(VLOOKUP(I63,Definitioner!$P$2:$S$381,2,FALSE)),\"\",VLOOKUP(I63,Definitioner!$P$2:$S$381,2,FALSE)),VLOOKUP(I63,Definitioner!$O$2:$S$381,3,FALSE)))","v":""},{"$f":"IF(A63<>\"\",VLOOKUP(A63,Definitioner!$A$2:$B$123,2),\"\")","v":""},null,null,{"$f":"IF(LEN(A63),LimitLookup($A63,\"HP14\",2),\"\")","v":""},{"$f":"IF(LEN(A63),LimitLookup($A63,\"HP14\",3),\"\")","v":""},{"$f":"IF(LEN(A63),LimitLookup($A63,\"HP14\",4),\"\")","v":""},{"$f":"IF(LEN(A63),LimitLookup($A63,\"HP14\",5),\"\")","v":""}]
[{"$f":"IF(I64=\"\",\"\",IF($A$3=\"ELIMS\",IF(ISNA(VLOOKUP(I64,Definitioner!$P$2:$S$381,2,FALSE)),\"\",VLOOKUP(I64,Definitioner!$P$2:$S$381,2,FALSE)),VLOOKUP(I64,Definitioner!$O$2:$S$381,3,FALSE)))","v":""},{"$f":"IF(A64<>\"\",VLOOKUP(A64,Definitioner!$A$2:$B$123,2),\"\")","v":""},null,null,{"$f":"IF(LEN(A64),LimitLookup($A64,\"HP14\",2),\"\")","v":""},{"$f":"IF(LEN(A64),LimitLookup($A64,\"HP14\",3),\"\")","v":""},{"$f":"IF(LEN(A64),LimitLookup($A64,\"HP14\",4),\"\")","v":""},{"$f":"IF(LEN(A64),LimitLookup($A64,\"HP14\",5),\"\")","v":""}]
[{"$f":"IF(I65=\"\",\"\",IF($A$3=\"ELIMS\",IF(ISNA(VLOOKUP(I65,Definitioner!$P$2:$S$381,2,FALSE)),\"\",VLOOKUP(I65,Definitioner!$P$2:$S$381,2,FALSE)),VLOOKUP(I65,Definitioner!$O$2:$S$381,3,FALSE)))","v":""},{"$f":"IF(A65<>\"\",VLOOKUP(A65,Definitioner!$A$2:$B$123,2),\"\")","v":""},null,null,{"$f":"IF(LEN(A65),LimitLookup($A65,\"HP14\",2),\"\")","v":""},{"$f":"IF(LEN(A65),LimitLookup($A65,\"HP14\",3),\"\")","v":""},{"$f":"IF(LEN(A65),LimitLookup($A65,\"HP14\",4),\"\")","v":""},{"$f":"IF(LEN(A65),LimitLookup($A65,\"HP14\",5),\"\")","v":""}]
[{"$f":"IF(I66=\"\",\"\",IF($A$3=\"ELIMS\",IF(ISNA(VLOOKUP(I66,Definitioner!$P$2:$S$381,2,FALSE)),\"\",VLOOKUP(I66,Definitioner!$P$2:$S$381,2,FALSE)),VLOOKUP(I66,Definitioner!$O$2:$S$381,3,FALSE)))","v":""},{"$f":"IF(A66<>\"\",VLOOKUP(A66,Definitioner!$A$2:$B$123,2),\"\")","v":""},null,null,{"$f":"IF(LEN(A66),LimitLookup($A66,\"HP14\",2),\"\")","v":""},{"$f":"IF(LEN(A66),LimitLookup($A66,\"HP14\",3),\"\")","v":""},{"$f":"IF(LEN(A66),LimitLookup($A66,\"HP14\",4),\"\")","v":""},{"$f":"IF(LEN(A66),LimitLookup($A66,\"HP14\",5),\"\")","v":""}]
[{"$f":"IF(I67=\"\",\"\",IF($A$3=\"ELIMS\",IF(ISNA(VLOOKUP(I67,Definitioner!$P$2:$S$381,2,FALSE)),\"\",VLOOKUP(I67,Definitioner!$P$2:$S$381,2,FALSE)),VLOOKUP(I67,Definitioner!$O$2:$S$381,3,FALSE)))","v":""},{"$f":"IF(A67<>\"\",VLOOKUP(A67,Definitioner!$A$2:$B$123,2),\"\")","v":""},null,null,{"$f":"IF(LEN(A67),LimitLookup($A67,\"HP14\",2),\"\")","v":""},{"$f":"IF(LEN(A67),LimitLookup($A67,\"HP14\",3),\"\")","v":""},{"$f":"IF(LEN(A67),LimitLookup($A67,\"HP14\",4),\"\")","v":""},{"$f":"IF(LEN(A67),LimitLookup($A67,\"HP14\",5),\"\")","v":""}]
[{"$f":"IF(I68=\"\",\"\",IF($A$3=\"ELIMS\",IF(ISNA(VLOOKUP(I68,Definitioner!$P$2:$S$381,2,FALSE)),\"\",VLOOKUP(I68,Definitioner!$P$2:$S$381,2,FALSE)),VLOOKUP(I68,Definitioner!$O$2:$S$381,3,FALSE)))","v":""},{"$f":"IF(A68<>\"\",VLOOKUP(A68,Definitioner!$A$2:$B$123,2),\"\")","v":""},null,null,{"$f":"IF(LEN(A68),LimitLookup($A68,\"HP14\",2),\"\")","v":""},{"$f":"IF(LEN(A68),LimitLookup($A68,\"HP14\",3),\"\")","v":""},{"$f":"IF(LEN(A68),LimitLookup($A68,\"HP14\",4),\"\")","v":""},{"$f":"IF(LEN(A68),LimitLookup($A68,\"HP14\",5),\"\")","v":""}]
[{"$f":"IF(I69=\"\",\"\",IF($A$3=\"ELIMS\",IF(ISNA(VLOOKUP(I69,Definitioner!$P$2:$S$381,2,FALSE)),\"\",VLOOKUP(I69,Definitioner!$P$2:$S$381,2,FALSE)),VLOOKUP(I69,Definitioner!$O$2:$S$381,3,FALSE)))","v":""},{"$f":"IF(A69<>\"\",VLOOKUP(A69,Definitioner!$A$2:$B$123,2),\"\")","v":""},null,null,{"$f":"IF(LEN(A69),LimitLookup($A69,\"HP14\",2),\"\")","v":""},{"$f":"IF(LEN(A69),LimitLookup($A69,\"HP14\",3),\"\")","v":""},{"$f":"IF(LEN(A69),LimitLookup($A69,\"HP14\",4),\"\")","v":""},{"$f":"IF(LEN(A69),LimitLookup($A69,\"HP14\",5),\"\")","v":""}]
[{"$f":"IF(I70=\"\",\"\",IF($A$3=\"ELIMS\",IF(ISNA(VLOOKUP(I70,Definitioner!$P$2:$S$381,2,FALSE)),\"\",VLOOKUP(I70,Definitioner!$P$2:$S$381,2,FALSE)),VLOOKUP(I70,Definitioner!$O$2:$S$381,3,FALSE)))","v":""},{"$f":"IF(A70<>\"\",VLOOKUP(A70,Definitioner!$A$2:$B$123,2),\"\")","v":""},null,null,{"$f":"IF(LEN(A70),LimitLookup($A70,\"HP14\",2),\"\")","v":""},{"$f":"IF(LEN(A70),LimitLookup($A70,\"HP14\",3),\"\")","v":""},{"$f":"IF(LEN(A70),LimitLookup($A70,\"HP14\",4),\"\")","v":""},{"$f":"IF(LEN(A70),LimitLookup($A70,\"HP14\",5),\"\")","v":""}]
[{"$f":"IF(I71=\"\",\"\",IF($A$3=\"ELIMS\",IF(ISNA(VLOOKUP(I71,Definitioner!$P$2:$S$381,2,FALSE)),\"\",VLOOKUP(I71,Definitioner!$P$2:$S$381,2,FALSE)),VLOOKUP(I71,Definitioner!$O$2:$S$381,3,FALSE)))","v":""},{"$f":"IF(A71<>\"\",VLOOKUP(A71,Definitioner!$A$2:$B$123,2),\"\")","v":""},null,null,{"$f":"IF(LEN(A71),LimitLookup($A71,\"HP14\",2),\"\")","v":""},{"$f":"IF(LEN(A71),LimitLookup($A71,\"HP14\",3),\"\")","v":""},{"$f":"IF(LEN(A71),LimitLookup($A71,\"HP14\",4),\"\")","v":""},{"$f":"IF(LEN(A71),LimitLookup($A71,\"HP14\",5),\"\")","v":""}]
[{"$f":"IF(I72=\"\",\"\",IF($A$3=\"ELIMS\",IF(ISNA(VLOOKUP(I72,Definitioner!$P$2:$S$381,2,FALSE)),\"\",VLOOKUP(I72,Definitioner!$P$2:$S$381,2,FALSE)),VLOOKUP(I72,Definitioner!$O$2:$S$381,3,FALSE)))","v":""},{"$f":"IF(A72<>\"\",VLOOKUP(A72,Definitioner!$A$2:$B$123,2),\"\")","v":""},null,null,{"$f":"IF(LEN(A72),LimitLookup($A72,\"HP14\",2),\"\")","v":""},{"$f":"IF(LEN(A72),LimitLookup($A72,\"HP14\",3),\"\")","v":""},{"$f":"IF(LEN(A72),LimitLookup($A72,\"HP14\",4),\"\")","v":""},{"$f":"IF(LEN(A72),LimitLookup($A72,\"HP14\",5),\"\")","v":""}]
[{"$f":"IF(I73=\"\",\"\",IF($A$3=\"ELIMS\",IF(ISNA(VLOOKUP(I73,Definitioner!$P$2:$S$381,2,FALSE)),\"\",VLOOKUP(I73,Definitioner!$P$2:$S$381,2,FALSE)),VLOOKUP(I73,Definitioner!$O$2:$S$381,3,FALSE)))","v":""},{"$f":"IF(A73<>\"\",VLOOKUP(A73,Definitioner!$A$2:$B$123,2),\"\")","v":""},null,null,{"$f":"IF(LEN(A73),LimitLookup($A73,\"HP14\",2),\"\")","v":""},{"$f":"IF(LEN(A73),LimitLookup($A73,\"HP14\",3),\"\")","v":""},{"$f":"IF(LEN(A73),LimitLookup($A73,\"HP14\",4),\"\")","v":""},{"$f":"IF(LEN(A73),LimitLookup($A73,\"HP14\",5),\"\")","v":""}]
[{"$f":"IF(I74=\"\",\"\",IF($A$3=\"ELIMS\",IF(ISNA(VLOOKUP(I74,Definitioner!$P$2:$S$381,2,FALSE)),\"\",VLOOKUP(I74,Definitioner!$P$2:$S$381,2,FALSE)),VLOOKUP(I74,Definitioner!$O$2:$S$381,3,FALSE)))","v":""},{"$f":"IF(A74<>\"\",VLOOKUP(A74,Definitioner!$A$2:$B$123,2),\"\")","v":""},null,null,{"$f":"IF(LEN(A74),LimitLookup($A74,\"HP14\",2),\"\")","v":""},{"$f":"IF(LEN(A74),LimitLookup($A74,\"HP14\",3),\"\")","v":""},{"$f":"IF(LEN(A74),LimitLookup($A74,\"HP14\",4),\"\")","v":""},{"$f":"IF(LEN(A74),LimitLookup($A74,\"HP14\",5),\"\")","v":""}]
[{"$f":"IF(I75=\"\",\"\",IF($A$3=\"ELIMS\",IF(ISNA(VLOOKUP(I75,Definitioner!$P$2:$S$381,2,FALSE)),\"\",VLOOKUP(I75,Definitioner!$P$2:$S$381,2,FALSE)),VLOOKUP(I75,Definitioner!$O$2:$S$381,3,FALSE)))","v":""},{"$f":"IF(A75<>\"\",VLOOKUP(A75,Definitioner!$A$2:$B$123,2),\"\")","v":""},null,null,{"$f":"IF(LEN(A75),LimitLookup($A75,\"HP14\",2),\"\")","v":""},{"$f":"IF(LEN(A75),LimitLookup($A75,\"HP14\",3),\"\")","v":""},{"$f":"IF(LEN(A75),LimitLookup($A75,\"HP14\",4),\"\")","v":""},{"$f":"IF(LEN(A75),LimitLookup($A75,\"HP14\",5),\"\")","v":""}]
[{"$f":"IF(I76=\"\",\"\",IF($A$3=\"ELIMS\",IF(ISNA(VLOOKUP(I76,Definitioner!$P$2:$S$381,2,FALSE)),\"\",VLOOKUP(I76,Definitioner!$P$2:$S$381,2,FALSE)),VLOOKUP(I76,Definitioner!$O$2:$S$381,3,FALSE)))","v":""},{"$f":"IF(A76<>\"\",VLOOKUP(A76,Definitioner!$A$2:$B$123,2),\"\")","v":""},null,null,{"$f":"IF(LEN(A76),LimitLookup($A76,\"HP14\",2),\"\")","v":""},{"$f":"IF(LEN(A76),LimitLookup($A76,\"HP14\",3),\"\")","v":""},{"$f":"IF(LEN(A76),LimitLookup($A76,\"HP14\",4),\"\")","v":""},{"$f":"IF(LEN(A76),LimitLookup($A76,\"HP14\",5),\"\")","v":""}]
[{"$f":"IF(I77=\"\",\"\",IF($A$3=\"ELIMS\",IF(ISNA(VLOOKUP(I77,Definitioner!$P$2:$S$381,2,FALSE)),\"\",VLOOKUP(I77,Definitioner!$P$2:$S$381,2,FALSE)),VLOOKUP(I77,Definitioner!$O$2:$S$381,3,FALSE)))","v":""},{"$f":"IF(A77<>\"\",VLOOKUP(A77,Definitioner!$A$2:$B$123,2),\"\")","v":""},null,null,{"$f":"IF(LEN(A77),LimitLookup($A77,\"HP14\",2),\"\")","v":""},{"$f":"IF(LEN(A77),LimitLookup($A77,\"HP14\",3),\"\")","v":""},{"$f":"IF(LEN(A77),LimitLookup($A77,\"HP14\",4),\"\")","v":""},{"$f":"IF(LEN(A77),LimitLookup($A77,\"HP14\",5),\"\")","v":""}]
[{"$f":"IF(I78=\"\",\"\",IF($A$3=\"ELIMS\",IF(ISNA(VLOOKUP(I78,Definitioner!$P$2:$S$381,2,FALSE)),\"\",VLOOKUP(I78,Definitioner!$P$2:$S$381,2,FALSE)),VLOOKUP(I78,Definitioner!$O$2:$S$381,3,FALSE)))","v":""},{"$f":"IF(A78<>\"\",VLOOKUP(A78,Definitioner!$A$2:$B$123,2),\"\")","v":""},null,null,{"$f":"IF(LEN(A78),LimitLookup($A78,\"HP14\",2),\"\")","v":""},{"$f":"IF(LEN(A78),LimitLookup($A78,\"HP14\",3),\"\")","v":""},{"$f":"IF(LEN(A78),LimitLookup($A78,\"HP14\",4),\"\")","v":""},{"$f":"IF(LEN(A78),LimitLookup($A78,\"HP14\",5),\"\")","v":""}]
[{"$f":"IF(I79=\"\",\"\",IF($A$3=\"ELIMS\",IF(ISNA(VLOOKUP(I79,Definitioner!$P$2:$S$381,2,FALSE)),\"\",VLOOKUP(I79,Definitioner!$P$2:$S$381,2,FALSE)),VLOOKUP(I79,Definitioner!$O$2:$S$381,3,FALSE)))","v":""},{"$f":"IF(A79<>\"\",VLOOKUP(A79,Definitioner!$A$2:$B$123,2),\"\")","v":""},null,null,{"$f":"IF(LEN(A79),LimitLookup($A79,\"HP14\",2),\"\")","v":""},{"$f":"IF(LEN(A79),LimitLookup($A79,\"HP14\",3),\"\")","v":""},{"$f":"IF(LEN(A79),LimitLookup($A79,\"HP14\",4),\"\")","v":""},{"$f":"IF(LEN(A79),LimitLookup($A79,\"HP14\",5),\"\")","v":""}]
[{"$f":"IF(I80=\"\",\"\",IF($A$3=\"ELIMS\",IF(ISNA(VLOOKUP(I80,Definitioner!$P$2:$S$381,2,FALSE)),\"\",VLOOKUP(I80,Definitioner!$P$2:$S$381,2,FALSE)),VLOOKUP(I80,Definitioner!$O$2:$S$381,3,FALSE)))","v":""},{"$f":"IF(A80<>\"\",VLOOKUP(A80,Definitioner!$A$2:$B$123,2),\"\")","v":""},null,null,{"$f":"IF(LEN(A80),LimitLookup($A80,\"HP14\",2),\"\")","v":""},{"$f":"IF(LEN(A80),LimitLookup($A80,\"HP14\",3),\"\")","v":""},{"$f":"IF(LEN(A80),LimitLookup($A80,\"HP14\",4),\"\")","v":""},{"$f":"IF(LEN(A80),LimitLookup($A80,\"HP14\",5),\"\")","v":""}]
[{"$f":"IF(I81=\"\",\"\",IF($A$3=\"ELIMS\",IF(ISNA(VLOOKUP(I81,Definitioner!$P$2:$S$381,2,FALSE)),\"\",VLOOKUP(I81,Definitioner!$P$2:$S$381,2,FALSE)),VLOOKUP(I81,Definitioner!$O$2:$S$381,3,FALSE)))","v":""},{"$f":"IF(A81<>\"\",VLOOKUP(A81,Definitioner!$A$2:$B$123,2),\"\")","v":""},null,null,{"$f":"IF(LEN(A81),LimitLookup($A81,\"HP14\",2),\"\")","v":""},{"$f":"IF(LEN(A81),LimitLookup($A81,\"HP14\",3),\"\")","v":""},{"$f":"IF(LEN(A81),LimitLookup($A81,\"HP14\",4),\"\")","v":""},{"$f":"IF(LEN(A81),LimitLookup($A81,\"HP14\",5),\"\")","v":""}]
[{"$f":"IF(I82=\"\",\"\",IF($A$3=\"ELIMS\",IF(ISNA(VLOOKUP(I82,Definitioner!$P$2:$S$381,2,FALSE)),\"\",VLOOKUP(I82,Definitioner!$P$2:$S$381,2,FALSE)),VLOOKUP(I82,Definitioner!$O$2:$S$381,3,FALSE)))","v":""},{"$f":"IF(A82<>\"\",VLOOKUP(A82,Definitioner!$A$2:$B$123,2),\"\")","v":""},null,null,{"$f":"IF(LEN(A82),LimitLookup($A82,\"HP14\",2),\"\")","v":""},{"$f":"IF(LEN(A82),LimitLookup($A82,\"HP14\",3),\"\")","v":""},{"$f":"IF(LEN(A82),LimitLookup($A82,\"HP14\",4),\"\")","v":""},{"$f":"IF(LEN(A82),LimitLookup($A82,\"HP14\",5),\"\")","v":""}]
[{"$f":"IF(I83=\"\",\"\",IF($A$3=\"ELIMS\",IF(ISNA(VLOOKUP(I83,Definitioner!$P$2:$S$381,2,FALSE)),\"\",VLOOKUP(I83,Definitioner!$P$2:$S$381,2,FALSE)),VLOOKUP(I83,Definitioner!$O$2:$S$381,3,FALSE)))","v":""},{"$f":"IF(A83<>\"\",VLOOKUP(A83,Definitioner!$A$2:$B$123,2),\"\")","v":""},null,null,{"$f":"IF(LEN(A83),LimitLookup($A83,\"HP14\",2),\"\")","v":""},{"$f":"IF(LEN(A83),LimitLookup($A83,\"HP14\",3),\"\")","v":""},{"$f":"IF(LEN(A83),LimitLookup($A83,\"HP14\",4),\"\")","v":""},{"$f":"IF(LEN(A83),LimitLookup($A83,\"HP14\",5),\"\")","v":""}]
[{"$f":"IF(I84=\"\",\"\",IF($A$3=\"ELIMS\",IF(ISNA(VLOOKUP(I84,Definitioner!$P$2:$S$381,2,FALSE)),\"\",VLOOKUP(I84,Definitioner!$P$2:$S$381,2,FALSE)),VLOOKUP(I84,Definitioner!$O$2:$S$381,3,FALSE)))","v":""},{"$f":"IF(A84<>\"\",VLOOKUP(A84,Definitioner!$A$2:$B$123,2),\"\")","v":""},null,null,{"$f":"IF(LEN(A84),LimitLookup($A84,\"HP14\",2),\"\")","v":""},{"$f":"IF(LEN(A84),LimitLookup($A84,\"HP14\",3),\"\")","v":""},{"$f":"IF(LEN(A84),LimitLookup($A84,\"HP14\",4),\"\")","v":""},{"$f":"IF(LEN(A84),LimitLookup($A84,\"HP14\",5),\"\")","v":""}]
[{"$f":"IF(I85=\"\",\"\",IF($A$3=\"ELIMS\",IF(ISNA(VLOOKUP(I85,Definitioner!$P$2:$S$381,2,FALSE)),\"\",VLOOKUP(I85,Definitioner!$P$2:$S$381,2,FALSE)),VLOOKUP(I85,Definitioner!$O$2:$S$381,3,FALSE)))","v":""},{"$f":"IF(A85<>\"\",VLOOKUP(A85,Definitioner!$A$2:$B$123,2),\"\")","v":""},null,null,{"$f":"IF(LEN(A85),LimitLookup($A85,\"HP14\",2),\"\")","v":""},{"$f":"IF(LEN(A85),LimitLookup($A85,\"HP14\",3),\"\")","v":""},{"$f":"IF(LEN(A85),LimitLookup($A85,\"HP14\",4),\"\")","v":""},{"$f":"IF(LEN(A85),LimitLookup($A85,\"HP14\",5),\"\")","v":""}]
[{"$f":"IF(I86=\"\",\"\",IF($A$3=\"ELIMS\",IF(ISNA(VLOOKUP(I86,Definitioner!$P$2:$S$381,2,FALSE)),\"\",VLOOKUP(I86,Definitioner!$P$2:$S$381,2,FALSE)),VLOOKUP(I86,Definitioner!$O$2:$S$381,3,FALSE)))","v":""},{"$f":"IF(A86<>\"\",VLOOKUP(A86,Definitioner!$A$2:$B$123,2),\"\")","v":""},null,null,{"$f":"IF(LEN(A86),LimitLookup($A86,\"HP14\",2),\"\")","v":""},{"$f":"IF(LEN(A86),LimitLookup($A86,\"HP14\",3),\"\")","v":""},{"$f":"IF(LEN(A86),LimitLookup($A86,\"HP14\",4),\"\")","v":""},{"$f":"IF(LEN(A86),LimitLookup($A86,\"HP14\",5),\"\")","v":""}]
[{"$f":"IF(I87=\"\",\"\",IF($A$3=\"ELIMS\",IF(ISNA(VLOOKUP(I87,Definitioner!$P$2:$S$381,2,FALSE)),\"\",VLOOKUP(I87,Definitioner!$P$2:$S$381,2,FALSE)),VLOOKUP(I87,Definitioner!$O$2:$S$381,3,FALSE)))","v":""},{"$f":"IF(A87<>\"\",VLOOKUP(A87,Definitioner!$A$2:$B$123,2),\"\")","v":""},null,null,{"$f":"IF(LEN(A87),LimitLookup($A87,\"HP14\",2),\"\")","v":""},{"$f":"IF(LEN(A87),LimitLookup($A87,\"HP14\",3),\"\")","v":""},{"$f":"IF(LEN(A87),LimitLookup($A87,\"HP14\",4),\"\")","v":""},{"$f":"IF(LEN(A87),LimitLookup($A87,\"HP14\",5),\"\")","v":""}]
[{"$f":"IF(I88=\"\",\"\",IF($A$3=\"ELIMS\",IF(ISNA(VLOOKUP(I88,Definitioner!$P$2:$S$381,2,FALSE)),\"\",VLOOKUP(I88,Definitioner!$P$2:$S$381,2,FALSE)),VLOOKUP(I88,Definitioner!$O$2:$S$381,3,FALSE)))","v":""},{"$f":"IF(A88<>\"\",VLOOKUP(A88,Definitioner!$A$2:$B$123,2),\"\")","v":""},null,null,{"$f":"IF(LEN(A88),LimitLookup($A88,\"HP14\",2),\"\")","v":""},{"$f":"IF(LEN(A88),LimitLookup($A88,\"HP14\",3),\"\")","v":""},{"$f":"IF(LEN(A88),LimitLookup($A88,\"HP14\",4),\"\")","v":""},{"$f":"IF(LEN(A88),LimitLookup($A88,\"HP14\",5),\"\")","v":""}]
[{"$f":"IF(I89=\"\",\"\",IF($A$3=\"ELIMS\",IF(ISNA(VLOOKUP(I89,Definitioner!$P$2:$S$381,2,FALSE)),\"\",VLOOKUP(I89,Definitioner!$P$2:$S$381,2,FALSE)),VLOOKUP(I89,Definitioner!$O$2:$S$381,3,FALSE)))","v":""},{"$f":"IF(A89<>\"\",VLOOKUP(A89,Definitioner!$A$2:$B$123,2),\"\")","v":""},null,null,{"$f":"IF(LEN(A89),LimitLookup($A89,\"HP14\",2),\"\")","v":""},{"$f":"IF(LEN(A89),LimitLookup($A89,\"HP14\",3),\"\")","v":""},{"$f":"IF(LEN(A89),LimitLookup($A89,\"HP14\",4),\"\")","v":""},{"$f":"IF(LEN(A89),LimitLookup($A89,\"HP14\",5),\"\")","v":""}]
[{"$f":"IF(I90=\"\",\"\",IF($A$3=\"ELIMS\",IF(ISNA(VLOOKUP(I90,Definitioner!$P$2:$S$381,2,FALSE)),\"\",VLOOKUP(I90,Definitioner!$P$2:$S$381,2,FALSE)),VLOOKUP(I90,Definitioner!$O$2:$S$381,3,FALSE)))","v":""},{"$f":"IF(A90<>\"\",VLOOKUP(A90,Definitioner!$A$2:$B$123,2),\"\")","v":""},null,null,{"$f":"IF(LEN(A90),LimitLookup($A90,\"HP14\",2),\"\")","v":""},{"$f":"IF(LEN(A90),LimitLookup($A90,\"HP14\",3),\"\")","v":""},{"$f":"IF(LEN(A90),LimitLookup($A90,\"HP14\",4),\"\")","v":""},{"$f":"IF(LEN(A90),LimitLookup($A90,\"HP14\",5),\"\")","v":""}]
[{"$f":"IF(I91=\"\",\"\",IF($A$3=\"ELIMS\",IF(ISNA(VLOOKUP(I91,Definitioner!$P$2:$S$381,2,FALSE)),\"\",VLOOKUP(I91,Definitioner!$P$2:$S$381,2,FALSE)),VLOOKUP(I91,Definitioner!$O$2:$S$381,3,FALSE)))","v":""},{"$f":"IF(A91<>\"\",VLOOKUP(A91,Definitioner!$A$2:$B$123,2),\"\")","v":""},null,null,{"$f":"IF(LEN(A91),LimitLookup($A91,\"HP14\",2),\"\")","v":""},{"$f":"IF(LEN(A91),LimitLookup($A91,\"HP14\",3),\"\")","v":""},{"$f":"IF(LEN(A91),LimitLookup($A91,\"HP14\",4),\"\")","v":""},{"$f":"IF(LEN(A91),LimitLookup($A91,\"HP14\",5),\"\")","v":""}]
[{"$f":"IF(I92=\"\",\"\",IF($A$3=\"ELIMS\",IF(ISNA(VLOOKUP(I92,Definitioner!$P$2:$S$381,2,FALSE)),\"\",VLOOKUP(I92,Definitioner!$P$2:$S$381,2,FALSE)),VLOOKUP(I92,Definitioner!$O$2:$S$381,3,FALSE)))","v":""},{"$f":"IF(A92<>\"\",VLOOKUP(A92,Definitioner!$A$2:$B$123,2),\"\")","v":""},null,null,{"$f":"IF(LEN(A92),LimitLookup($A92,\"HP14\",2),\"\")","v":""},{"$f":"IF(LEN(A92),LimitLookup($A92,\"HP14\",3),\"\")","v":""},{"$f":"IF(LEN(A92),LimitLookup($A92,\"HP14\",4),\"\")","v":""},{"$f":"IF(LEN(A92),LimitLookup($A92,\"HP14\",5),\"\")","v":""}]
[{"$f":"IF(I93=\"\",\"\",IF($A$3=\"ELIMS\",IF(ISNA(VLOOKUP(I93,Definitioner!$P$2:$S$381,2,FALSE)),\"\",VLOOKUP(I93,Definitioner!$P$2:$S$381,2,FALSE)),VLOOKUP(I93,Definitioner!$O$2:$S$381,3,FALSE)))","v":""},{"$f":"IF(A93<>\"\",VLOOKUP(A93,Definitioner!$A$2:$B$123,2),\"\")","v":""},null,null,{"$f":"IF(LEN(A93),LimitLookup($A93,\"HP14\",2),\"\")","v":""},{"$f":"IF(LEN(A93),LimitLookup($A93,\"HP14\",3),\"\")","v":""},{"$f":"IF(LEN(A93),LimitLookup($A93,\"HP14\",4),\"\")","v":""},{"$f":"IF(LEN(A93),LimitLookup($A93,\"HP14\",5),\"\")","v":""}]
[{"$f":"IF(I94=\"\",\"\",IF($A$3=\"ELIMS\",IF(ISNA(VLOOKUP(I94,Definitioner!$P$2:$S$381,2,FALSE)),\"\",VLOOKUP(I94,Definitioner!$P$2:$S$381,2,FALSE)),VLOOKUP(I94,Definitioner!$O$2:$S$381,3,FALSE)))","v":""},{"$f":"IF(A94<>\"\",VLOOKUP(A94,Definitioner!$A$2:$B$123,2),\"\")","v":""},null,null,{"$f":"IF(LEN(A94),LimitLookup($A94,\"HP14\",2),\"\")","v":""},{"$f":"IF(LEN(A94),LimitLookup($A94,\"HP14\",3),\"\")","v":""},{"$f":"IF(LEN(A94),LimitLookup($A94,\"HP14\",4),\"\")","v":""},{"$f":"IF(LEN(A94),LimitLookup($A94,\"HP14\",5),\"\")","v":""}]
[{"$f":"IF(I95=\"\",\"\",IF($A$3=\"ELIMS\",IF(ISNA(VLOOKUP(I95,Definitioner!$P$2:$S$381,2,FALSE)),\"\",VLOOKUP(I95,Definitioner!$P$2:$S$381,2,FALSE)),VLOOKUP(I95,Definitioner!$O$2:$S$381,3,FALSE)))","v":""},{"$f":"IF(A95<>\"\",VLOOKUP(A95,Definitioner!$A$2:$B$123,2),\"\")","v":""},null,null,{"$f":"IF(LEN(A95),LimitLookup($A95,\"HP14\",2),\"\")","v":""},{"$f":"IF(LEN(A95),LimitLookup($A95,\"HP14\",3),\"\")","v":""},{"$f":"IF(LEN(A95),LimitLookup($A95,\"HP14\",4),\"\")","v":""},{"$f":"IF(LEN(A95),LimitLookup($A95,\"HP14\",5),\"\")","v":""}]
[{"$f":"IF(I96=\"\",\"\",IF($A$3=\"ELIMS\",IF(ISNA(VLOOKUP(I96,Definitioner!$P$2:$S$381,2,FALSE)),\"\",VLOOKUP(I96,Definitioner!$P$2:$S$381,2,FALSE)),VLOOKUP(I96,Definitioner!$O$2:$S$381,3,FALSE)))","v":""},{"$f":"IF(A96<>\"\",VLOOKUP(A96,Definitioner!$A$2:$B$123,2),\"\")","v":""},null,null,{"$f":"IF(LEN(A96),LimitLookup($A96,\"HP14\",2),\"\")","v":""},{"$f":"IF(LEN(A96),LimitLookup($A96,\"HP14\",3),\"\")","v":""},{"$f":"IF(LEN(A96),LimitLookup($A96,\"HP14\",4),\"\")","v":""},{"$f":"IF(LEN(A96),LimitLookup($A96,\"HP14\",5),\"\")","v":""}]
[{"$f":"IF(I97=\"\",\"\",IF($A$3=\"ELIMS\",IF(ISNA(VLOOKUP(I97,Definitioner!$P$2:$S$381,2,FALSE)),\"\",VLOOKUP(I97,Definitioner!$P$2:$S$381,2,FALSE)),VLOOKUP(I97,Definitioner!$O$2:$S$381,3,FALSE)))","v":""},{"$f":"IF(A97<>\"\",VLOOKUP(A97,Definitioner!$A$2:$B$123,2),\"\")","v":""},null,null,{"$f":"IF(LEN(A97),LimitLookup($A97,\"HP14\",2),\"\")","v":""},{"$f":"IF(LEN(A97),LimitLookup($A97,\"HP14\",3),\"\")","v":""},{"$f":"IF(LEN(A97),LimitLookup($A97,\"HP14\",4),\"\")","v":""},{"$f":"IF(LEN(A97),LimitLookup($A97,\"HP14\",5),\"\")","v":""}]
[{"$f":"IF(I98=\"\",\"\",IF($A$3=\"ELIMS\",IF(ISNA(VLOOKUP(I98,Definitioner!$P$2:$S$381,2,FALSE)),\"\",VLOOKUP(I98,Definitioner!$P$2:$S$381,2,FALSE)),VLOOKUP(I98,Definitioner!$O$2:$S$381,3,FALSE)))","v":""},{"$f":"IF(A98<>\"\",VLOOKUP(A98,Definitioner!$A$2:$B$123,2),\"\")","v":""},null,null,{"$f":"IF(LEN(A98),LimitLookup($A98,\"HP14\",2),\"\")","v":""},{"$f":"IF(LEN(A98),LimitLookup($A98,\"HP14\",3),\"\")","v":""},{"$f":"IF(LEN(A98),LimitLookup($A98,\"HP14\",4),\"\")","v":""},{"$f":"IF(LEN(A98),LimitLookup($A98,\"HP14\",5),\"\")","v":""}]
[{"$f":"IF(I99=\"\",\"\",IF($A$3=\"ELIMS\",IF(ISNA(VLOOKUP(I99,Definitioner!$P$2:$S$381,2,FALSE)),\"\",VLOOKUP(I99,Definitioner!$P$2:$S$381,2,FALSE)),VLOOKUP(I99,Definitioner!$O$2:$S$381,3,FALSE)))","v":""},{"$f":"IF(A99<>\"\",VLOOKUP(A99,Definitioner!$A$2:$B$123,2),\"\")","v":""},null,null,{"$f":"IF(LEN(A99),LimitLookup($A99,\"HP14\",2),\"\")","v":""},{"$f":"IF(LEN(A99),LimitLookup($A99,\"HP14\",3),\"\")","v":""},{"$f":"IF(LEN(A99),LimitLookup($A99,\"HP14\",4),\"\")","v":""},{"$f":"IF(LEN(A99),LimitLookup($A99,\"HP14\",5),\"\")","v":""}]
[{"$f":"IF(I100=\"\",\"\",IF($A$3=\"ELIMS\",IF(ISNA(VLOOKUP(I100,Definitioner!$P$2:$S$381,2,FALSE)),\"\",VLOOKUP(I100,Definitioner!$P$2:$S$381,2,FALSE)),VLOOKUP(I100,Definitioner!$O$2:$S$381,3,FALSE)))","v":""},{"$f":"IF(A100<>\"\",VLOOKUP(A100,Definitioner!$A$2:$B$123,2),\"\")","v":""},null,null,{"$f":"IF(LEN(A100),LimitLookup($A100,\"HP14\",2),\"\")","v":""},{"$f":"IF(LEN(A100),LimitLookup($A100,\"HP14\",3),\"\")","v":""},{"$f":"IF(LEN(A100),LimitLookup($A100,\"HP14\",4),\"\")","v":""},{"$f":"IF(LEN(A100),LimitLookup($A100,\"HP14\",5),\"\")","v":""}]
[]
[null,"░ = Parameteren er IKKE medtaget i beregningen af kategorien."]
[null,"# = ingen af de indgående parametre i summen påvist"]
[null,"i.m. = ikke måleligt"]
[]
[]
[]
[]
[]
[]
[]
[]
[]
[]
[]
[null,"Udgave: 10.2020"]

{"sheet":"Definitioner","index":3,"n_rows":308,"n_cols":18,"rows_kept":308,"cut":false,"hidden":false,"merged":[]}
["Parameter ID","Parameter","Enhed",null,null,null,null,null,null,null,null,null,null,null,"Testnumber","Test|ParCode","Parameter-ID","Parameter-ID"]
[0,"Dybde","m",null,null,null,null,null,null,null,null,null,null,null,"41512","CA135|7003A001",1,{"$f":"OFFSET($B$2,MATCH(Q2,$A$3:$A$114,1),0)","v":"Arsen"}]
[1,"Arsen","mg/kg TS",null,null,null,null,null,null,null,null,null,null,null,"41530","CA136|7003A003",2,{"$f":"OFFSET($B$2,MATCH(Q3,$A$3:$A$114,1),0)","v":"Bly "}]
[2,"Bly ","mg/kg TS",null,null,null,null,null,null,null,null,null,null,null,"41545","CA137|7003A016",3,"Cadmium"]
[3,"Cadmium","mg/kg TS",null,null,null,null,null,null,null,null,null,null,null,"42010","CAA31|7300G093",4,"Chrom VI"]
[4,"Chrom VI","mg/kg TS",null,null,null,null,null,null,null,null,null,null,null,"42004","CA138|7003A005",5,"Chrom total"]
[5,"Chrom total","mg/kg TS",null,null,null,null,null,null,null,null,null,null,null,"42063","CA139|7001A010",6,"Kobber "]
[6,"Kobber ","mg/kg TS",null,null,null,null,null,null,null,null,null,null,null,"42072","CAA51|7003A019",7,"Kviksølv"]
[7,"Kviksølv","mg/kg TS",null,null,null,null,null,null,null,null,null,null,null,"42105","CA140|7003A007",8,"Nikkel"]
[8,"Nikkel","mg/kg TS",null,null,null,null,null,null,null,null,null,null,null,"42237","CAB14|7003A009",9,"Tin"]
[9,"Tin","mg/kg TS",null,null,null,null,null,null,null,null,null,null,null,"42251","CA141|7001A013",10,"Zink"]
[10,"Zink","mg/kg TS",null,null,null,null,null,null,null,null,null,null,null,"45529","CA0E7|MC000007",12,"C6-C10 (Reflab1)"]
[11,"Sum C6-C35 (Reflab1)","mg/kg TS",null,null,null,null,null,null,null,null,null,null,null,"45531","CA0E7|CA000269",13,"C10-C25 (Reflab1 gl.)"]
[12,"C6-C10 (Reflab1)","mg/kg TS",null,null,null,null,null,null,null,null,null,null,null,"45532","CA0E7|CA000278",14,"C25-C35 (Reflab1 gl.)"]
[13,"C10-C25 (Reflab1 gl.)","mg/kg TS",null,null,null,null,null,null,null,null,null,null,null,"45307","CA0EE|F001F063",15,"BTEX, sum"]
[14,"C25-C35 (Reflab1 gl.)","mg/kg TS",null,null,null,null,null,null,null,null,null,null,null,"45301","CA0EE|7300A124",16,"Benzen"]
[15,"BTEX, sum","mg/kg TS",null,null,null,null,null,null,null,null,null,null,null,null,"VL30V|7300A124",16,"Benzen"]
[16,"Benzen","mg/kg TS",null,null,null,null,null,null,null,null,null,null,null,"43841","CA144|7300G076",17,"Naphtalen"]
[17,"Naphtalen","mg/kg TS",null,null,null,null,null,null,null,null,null,null,null,"4385Z","CA302|CA001440",18,"Sum af 7 PAH'er"]
[18,"Sum af 7 PAH'er","mg/kg TS",null,null,null,null,null,null,null,null,null,null,null,"43855","CA08I|7300A035",19,"Benz(a)pyren"]
[19,"Benz(a)pyren","mg/kg TS",null,null,null,null,null,null,null,null,null,null,null,"43858","CA302|7300A366",20,"Dibenz(a,h)anthracen"]
[20,"Dibenz(a,h)anthracen","mg/kg TS",null,null,null,null,null,null,null,null,null,null,null,"43847","CA302|7300A359",24,"Fluoranthen"]
[21,"Phenoler, sum","mg/kg TS",null,null,null,null,null,null,null,null,null,null,null,"43854","CA302|GF00005X",25,"Benz(b+j+k)fluoranthen"]
[22,"Cyanid, total","ug/kg TS",null,null,null,null,null,null,null,null,null,null,null,"43857","CA302|7300A365",26,"Indeno(1,2,3-cd)pyren"]
[23,"Cyanid, syreflygtig","ug/kg TS",null,null,null,null,null,null,null,null,null,null,null,"4653Z","CA08G|CA001439",28,"Sum C6-C40 (Reflab4)"]
[24,"Fluoranthen","mg/kg TS",null,null,null,null,null,null,null,null,null,null,null,"46521","CA08G|MC000007",29,"C6-C10 (Reflab4)"]
[25,"Benz(b+j+k)fluoranthen","mg/kg TS",null,null,null,null,null,null,null,null,null,null,null,"46524","CA08G|CA001572",31,"C10-C15 (Reflab4)"]
[26,"Indeno(1,2,3-cd)pyren","mg/kg TS",null,null,null,null,null,null,null,null,null,null,null,"46527","CA08G|CA001573",32,"C15-C20 (Reflab4)"]
[27,"Chrom (bortset fra VI)","mg/kg TS",null,null,null,null,null,null,null,null,null,null,null,"46531","CA08G|CA001574",33,"C20-C40 (Reflab4)"]
[28,"Sum C6-C40 (Reflab4)","mg/kg TS",null,null,null,null,null,null,null,null,null,null,null,"4552B","CA0EH|CA000284",34,"Terpentin (C7-C12) (Reflab1)"]
[29,"C6-C10 (Reflab4)","mg/kg TS",null,null,null,null,null,null,null,null,null,null,null,"4552C","CA0EH|CA000289",35,"Petroleum (C9-C16) (Reflab1)"]
[30,"C10-C20 (Reflab4)","mg/kg TS",null,null,null,null,null,null,null,null,null,null,null,"46321","CA08J|7300A124",16,"Benzen"]
[31,"C10-C15 (Reflab4)","mg/kg TS",null,null,null,null,null,null,null,null,null,null,null,"46327","CA08J|F001F063",15,"BTEX, sum"]
[32,"C15-C20 (Reflab4)","mg/kg TS",null,null,null,null,null,null,null,null,null,null,null,"46331","CA0EB|7300A124",16,"Benzen"]
[33,"C20-C40 (Reflab4)","mg/kg TS",null,null,null,null,null,null,null,null,null,null,null,"46337","CA0EB|F001F063",15,"BTEX, sum"]
[34,"Terpentin (C7-C12) (Reflab1)","mg/kg TS",null,null,null,null,null,null,null,null,null,null,null,"4655Z","CA0E8|CA001439",28,"Sum C6-C40 (Reflab4)"]
[35,"Petroleum (C9-C16) (Reflab1)","mg/kg TS",null,null,null,null,null,null,null,null,null,null,null,"46541","CA0E8|MC000007",29,"C6-C10 (Reflab4)"]
[36,"Terpentin (C7-C12) (Reflab4)","mg/kg TS",null,null,null,null,null,null,null,null,null,null,null,"46544","CA0E8|CA001572",31,"C10-C15 (Reflab4)"]
[37,"Petroleum (C9-C16) (Reflab4)","mg/kg TS",null,null,null,null,null,null,null,null,null,null,null,"46547","CA0E8|CA001573",32,"C15-C20 (Reflab4)"]
[39,"Molybdæn","mg/kg TS",null,null,null,null,null,null,null,null,null,null,null,"46551","CA0E8|CA001574",33,"C20-C40 (Reflab4)"]
[40,"MTBE","mg/kg TS",null,null,null,null,null,null,null,null,null,null,null,"4685Z","CA08I|CA001440",18,"Sum af 7 PAH'er"]
[41,"Trichlorethylen","mg/kg TS",null,null,null,null,null,null,null,null,null,null,null,"46855","CA302|7300A035",19,"Benz(a)pyren"]
[42,"Tetrachlorethylen","mg/kg TS",null,null,null,null,null,null,null,null,null,null,null,"46858","CA08I|7300A366",20,"Dibenz(a,h)anthracen"]
[43,"Tetrachlormethan","mg/kg TS",null,null,null,null,null,null,null,null,null,null,null,"46847","CA08I|7300A359",24,"Fluoranthen"]
[44,"Toluen","mg/kg TS",null,null,null,null,null,null,null,null,null,null,null,"46854","CA08I|GF00005X",25,"Benz(b+j+k)fluoranthen"]
[45,"Ethylbenzen","mg/kg TS",null,null,null,null,null,null,null,null,null,null,null,"46857","CA08I|7300A365",26,"Indeno(1,2,3-cd)pyren"]
[46,"o-Xylen","mg/kg TS",null,null,null,null,null,null,null,null,null,null,null,"46841","CA0H9|7300G076",17,"Naphtalen"]
[47,"m+p-Xylen","mg/kg TS",null,null,null,null,null,null,null,null,null,null,null,"00006","CAR00|CA0015BA",0,{"$error":"#N/A"}]
[48,"C20-C35 (Reflab1)","mg/kg TS",null,null,null,null,null,null,null,null,null,null,null,"42093","CA144|7003A012",39,"Molybdæn"]
[49,"C15-C20 (Reflab1)","mg/kg TS",null,null,null,null,null,null,null,null,null,null,null,"43144","CA0ED|F001F247",40,"MTBE"]
[50,"C10-C15 (Reflab1)","mg/kg TS",null,null,null,null,null,null,null,null,null,null,null,"43205","CA0EG|7300G081",41,"Trichlorethylen"]
[51,"Sum C10-C20 (Reflab4)","mg/kg TS",null,null,null,null,null,null,null,null,null,null,null,"43206","CA0EG|7300G173",42,"Tetrachlorethylen"]
[52,"Sum C10-C20 (Reflab1)","mg/kg TS",null,null,null,null,null,null,null,null,null,null,null,"43204","CA0EG|7300J058",43,"Tetrachlormethan"]
[53,"Vinylchlorid","mg/kg TS",null,null,null,null,null,null,null,null,null,null,null,"46205","CA08K|7300G081",41,"Trichlorethylen"]
[54,"1,1-dichlorethylen","mg/kg TS",null,null,null,null,null,null,null,null,null,null,null,"46205","CA08K|7300G173",42,"Tetrachlorethylen"]
[55,"trans-1,2-dichlorethylen","mg/kg TS",null,null,null,null,null,null,null,null,null,null,null,"46204","CA08K|7300J058",43,"Tetrachlormethan"]
[56,"1,1-dichlorethan","mg/kg TS",null,null,null,null,null,null,null,null,null,null,null,"45302","CA0EE|C003A459",44,"Toluen"]
[57,"cis-1,2-dichlorethylen","mg/kg TS",null,null,null,null,null,null,null,null,null,null,null,"46322","CA08J|C003A459",44,"Toluen"]
[58,"Dichlormethan","mg/kg TS",null,null,null,null,null,null,null,null,null,null,null,null,"VL30V|7300A125",44,"Toluen"]
[59,"1,1,2-trichlorethan","mg/kg TS",null,null,null,null,null,null,null,null,null,null,null,"45303","CA0EE|7300A126",45,"Ethylbenzen"]
[60,"1,2-dichlorethan","mg/kg TS",null,null,null,null,null,null,null,null,null,null,null,"46323","CA08J|7300A126",45,"Ethylbenzen"]
[61,"1,2-dibromethan","mg/kg TS",null,null,null,null,null,null,null,null,null,null,null,null,"VL30V|7300A126",45,"Ethylbenzen"]
[62,"Chlorbenzen","mg/kg TS",null,null,null,null,null,null,null,null,null,null,null,"45305","CA0EE|7300A128",46,"o-Xylen"]
[63,"1,2-dichlorbenzen","mg/kg TS",null,null,null,null,null,null,null,null,null,null,null,"46325","CA08J|7300A128",46,"o-Xylen"]
[64,"1,4-dichlorbenzen","mg/kg TS",null,null,null,null,null,null,null,null,null,null,null,null,"VL30V|7300A128",46,"o-Xylen"]
[65,"Chlorethan","mg/kg TS",null,null,null,null,null,null,null,null,null,null,null,"45306","CA0EE|7300A127",47,"m+p-Xylen"]
[66,"TBA (tert-butyl-alkohol)","mg/kg TS",null,null,null,null,null,null,null,null,null,null,null,"46326","CA08J|7300A127",47,{"$f":"OFFSET($B$2,MATCH(Q67,$A$3:$A$114,1),0)","v":"m+p-Xylen"}]
[67,"methanol","mg/kg TS",null,null,null,null,null,null,null,null,null,null,null,null,"VL30V|Z001JJIL",47,"m+p-Xylen"]
[68,"Ethanol","mg/kg TS",null,null,null,null,null,null,null,null,null,null,null,"4556C","CA0E7|CA001572",50,"C10-C15 (Reflab1)"]
[69,"diethylether","mg/kg TS",null,null,null,null,null,null,null,null,null,null,null,"4556D","CA0E7|CA001573",49,"C15-C20 (Reflab1)"]
[70,"acetone","mg/kg TS",null,null,null,null,null,null,null,null,null,null,null,"4556E","CA0E7|CA00159R",48,"C20-C35 (Reflab1)"]
[71,"isopropanol","mg/kg TS",null,null,null,null,null,null,null,null,null,null,null,"4556Z","CA0E7|MC000004",11,"Sum C6-C35 (Reflab1)"]
[72,"1-propanol","mg/kg TS",null,null,null,null,null,null,null,null,null,null,null,null,"CA10L|7003A001",1,"Arsen"]
[73,"diisopropylether","mg/kg TS",null,null,null,null,null,null,null,null,null,null,null,null,"CA10L|7001A010",6,"Kobber "]
[74,"MEK","mg/kg TS",null,null,null,null,null,null,null,null,null,null,null,null,"CA10L|7003A003",2,"Bly "]
[75,"ethylacetat","mg/kg TS",null,null,null,null,null,null,null,null,null,null,null,null,"CA10L|7003A005",5,"Chrom total"]
[76,"methylacrylat","mg/kg TS",null,null,null,null,null,null,null,null,null,null,null,null,"CA10L|7003A007",8,"Nikkel"]
[77,"isobutanol","mg/kg TS",null,null,null,null,null,null,null,null,null,null,null,null,"CA10L|7001M011",10,"Zink"]
[78,"isopropylacetat","mg/kg TS",null,null,null,null,null,null,null,null,null,null,null,null,"CA10L|7003A016",3,"Cadmium"]
[79,"1-butanol","mg/kg TS",null,null,null,null,null,null,null,null,null,null,null,null,"CA319|7001A010",6,"Kobber "]
[80,"methylmetacrylat","mg/kg TS",null,null,null,null,null,null,null,null,null,null,null,null,"CA319|7003A003",2,"Bly "]
[81,"MIBK","mg/kg TS",null,null,null,null,null,null,null,null,null,null,null,null,"CA319|7003A005",5,"Chrom total"]
[82,"isobutylacetat","mg/kg TS",null,null,null,null,null,null,null,null,null,null,null,null,"CA319|7003A007",8,"Nikkel"]
[83,"butylacetat","mg/kg TS",null,null,null,null,null,null,null,null,null,null,null,null,"CA319|7001M011",10,"Zink"]
[84,"Vinylacetat","mg/kg TS",null,null,null,null,null,null,null,null,null,null,null,null,"CA319|7003A016",3,"Cadmium"]
[85,"Acetaldehyd","mg/kg TS",null,null,null,null,null,null,null,null,null,null,null,null,"CA320|7001A010",6,"Kobber "]
[86,"Sum af xylener","mg/kg TS",null,null,null,null,null,null,null,null,null,null,null,null,"CA320|7003A003",2,"Bly "]
[87,"Svovl, total","mg/kg TS",null,null,null,null,null,null,null,null,null,null,null,null,"CA320|7001M011",10,"Zink"]
[88,"Chloroform","mg/kg TS",null,null,null,null,null,null,null,null,null,null,null,null,"CA320|7003A016",3,"Cadmium"]
[89,"1,1,1-trichlorethan","mg/kg TS",null,null,null,null,null,null,null,null,null,null,null,null,"CA31A|CA0015CV",51,"Sum C10-C20 (Reflab4)"]
[90,"Cyanid, total","mg/kg",null,null,null,null,null,null,null,null,null,null,null,"4653Y","CA31B|CA0015CV",51,"Sum C10-C20 (Reflab4)"]
[91,"Pentachlorphenol","ug/kg TS",null,null,null,null,null,null,null,null,null,null,null,"4655Y","CA31C|CA0015CV",52,"Sum C10-C20 (Reflab1)"]
[92,"Barium","mg/kg TS",null,null,null,null,null,null,null,null,null,null,null,"4557R","CA31E|CA0015CV",51,"Sum C10-C20 (Reflab4)"]
[93,"PCB(total)*5","mg/kg TS",null,null,null,null,null,null,null,null,null,null,null,"4657Y","CA31A|MC000007",29,"C6-C10 (Reflab4)"]
[94,"Chlorparaffiner C10-C13","%",null,null,null,null,null,null,null,null,null,null,null,null,"CA31A|CA001572",31,"C10-C15 (Reflab4)"]
[95,"Chlorparaffiner C14-C17","%",null,null,null,null,null,null,null,null,null,null,null,null,"CA31A|CA001573",32,"C15-C20 (Reflab4)"]
[96,"Asbest",null,null,null,null,null,null,null,null,null,null,null,null,null,"CA31A|CA001574",33,"C20-C40 (Reflab4)"]
[97,"Aquatic Acute 1(H400)",null,null,null,null,null,null,null,null,null,null,null,null,null,"CA31B|MC000007",29,"C6-C10 (Reflab4)"]
[98,"Aquatic Chronic 1 (H410)",null,null,null,null,null,null,null,null,null,null,null,null,null,"CA31B|CA001572",31,"C10-C15 (Reflab4)"]
[99,"Tørstof","%",null,null,null,null,null,null,null,null,null,null,null,null,"CA31B|CA001573",32,"C15-C20 (Reflab4)"]
[100,"Phenol","mg/kg TS",null,null,null,null,null,null,null,null,null,null,null,null,"CA31B|CA001574",33,"C20-C40 (Reflab4)"]
[101,"Cresol (sum)","mg/kg TS",null,null,null,null,null,null,null,null,null,null,null,null,"CA31E|MC000007",29,"C6-C10 (Reflab4)"]
[102,"Xylenols","mg/kg TS",null,null,null,null,null,null,null,null,null,null,null,null,"CA31E|CA001572",31,"C10-C15 (Reflab4)"]
[103,"2-Methylphenol","mg/kg TS",null,null,null,null,null,null,null,null,null,null,null,null,"CA31E|CA001573",32,"C15-C20 (Reflab4)"]
[104,"3-Methylphenol","mg/kg TS",null,null,null,null,null,null,null,null,null,null,null,null,"CA31E|CA001574",33,"C20-C40 (Reflab4)"]
[105,"4-Methylphenol","mg/kg TS",null,null,null,null,null,null,null,null,null,null,null,null,"CA31C|MC000007",12,"C6-C10 (Reflab1)"]
[106,"2,3-Dimethylphenol","mg/kg TS",null,null,null,null,null,null,null,null,null,null,null,null,"CA31C|CA001572",50,"C10-C15 (Reflab1)"]
[107,"2,4-Dimethylphenol","mg/kg TS",null,null,null,null,null,null,null,null,null,null,null,null,"CA31C|CA001573",49,"C15-C20 (Reflab1)"]
[108,"2,5-Dimethylphenol","mg/kg TS",null,null,null,null,null,null,null,null,null,null,null,null,"CA31C|CA00159R",48,"C20-C35 (Reflab1)"]
[109,"2,6-Dimethylphenol","mg/kg TS",null,null,null,null,null,null,null,null,null,null,null,null,"CA31A|MC000004",28,"Sum C6-C40 (Reflab4)"]
[110,"3,4-Dimethylphenol","mg/kg TS",null,null,null,null,null,null,null,null,null,null,null,null,"CA31B|MC000004",28,"Sum C6-C40 (Reflab4)"]
[111,"3,5-Dimethylphenol","mg/kg TS",null,null,null,null,null,null,null,null,null,null,null,null,"CA31E|MC000004",28,"Sum C6-C40 (Reflab4)"]
[112,"Kobolt(Co)","mg/kg",null,null,null,null,null,null,null,null,null,null,null,null,"CA3AY|7003A011",112,"Kobolt(Co)"]
[113,"Mangan(Mn)","mg/kg",null,null,null,null,null,null,null,null,null,null,null,null,"CA31H|SL000045",113,"Mangan(Mn)"]
[114,"Vanadium(V)","mg/kg",null,null,null,null,null,null,null,null,null,null,null,null,"CA31I|7003A014",114,{"$f":"OFFSET($B$2,MATCH(Q115,$A$3:$A$115,1),0)","v":"Vanadium(V)"}]
[null,null,null,null,null,null,null,null,null,null,null,null,null,null,null,"CA31C|MC000004",11,"Sum C6-C35 (Reflab1)"]
[null,null,null,null,null,null,null,null,null,null,null,null,null,null,null,"CA08E|7300H104",53,"Vinylchlorid"]
[null,null,null,null,null,null,null,null,null,null,null,null,null,null,null,"CA08E|CA000026",54,"1,1-dichlorethylen"]
[null,null,null,null,null,null,null,null,null,null,null,null,null,null,null,"CA08E|CA001494",55,"trans-1,2-dichlorethylen"]
["Filepath:","\\\\dk01fivb.area1.eurofins.local\\LAB\\vaxlims\\JordKlassificering\\",null,null,null,null,null,null,null,null,null,null,null,null,null,"CA08E|7300J048",56,"1,1-dichlorethan"]
["Log:","JK.log",null,null,null,null,null,null,null,null,null,null,null,null,null,"CA08E|F001F048",57,"cis-1,2-dichlorethylen"]
["Logpath:","C:\\F76\\",null,null,null,null,null,null,null,null,null,null,null,null,null,"CA0LH|7300G083",58,"Dichlormethan"]
[null,null,null,null,null,null,null,null,null,null,null,null,null,null,null,"7300J045",59,"1,1,2-trichlorethan"]
["Filepath-elims","\\\\dk01fivb.area1.eurofins.local\\LAB\\vaxlims\\JordKlassificering\\",null,null,null,null,null,null,null,null,null,null,null,null,null,"CA0LF|7300A656",60,"1,2-dichlorethan"]
["Skabelon-fælles:","G:\\EurofinsCommon",null,null,null,null,null,null,null,null,null,null,null,null,null,"CA0LE|F001F503",61,"1,2-dibromethan"]
[null,null,null,null,null,null,null,null,null,null,null,null,null,null,null,"7300G090",62,"Chlorbenzen"]
["Kilde ID","Jord",null,null,"Klassifikationsfarver","GulToner","Trafiklys5","Trafiklys4",null,null,"Farve",null,null,null,null,"7300J015",63,"1,2-dichlorbenzen"]
[1,"Vejledning Sjælland",null,null,"Klasse 0",19,35,4,null,1,null,null,null,null,null,"7300J017",64,"1,4-dichlorbenzen"]
[2,"BEK nr.1452 + 554+tilføjelser",null,null,"Klasse 1",27,4,27,null,2,null,null,null,null,null,"CA08E|AN000011",65,"Chlorethan"]
[3,"BEK nr.1452 + 554",null,null,"Klasse 2",44,27,3,null,3,null,null,null,null,null,"CA328|F001F306",66,"TBA (tert-butyl-alkohol)"]
[4,"BEK nr.554",null,null,"Klasse 3",45,45,9,null,4,null,null,null,null,null,"CA328|7060A080",67,"methanol"]
[5,"Odense Kommune",null,null,"Klasse 4",46,3,2,null,5,null,null,null,null,null,"CA328|C003E413",68,{"$f":"OFFSET($B$2,MATCH(Q132,$A$3:$A$114,1),0)","v":"Ethanol"}]
[6,"Kbh. Kommune Jordregulativ",null,null,"Indgår ikke i klassificering",2,2,2,null,6,null,null,null,null,null,"CA328|F001F114",69,"diethylether"]
[7,"KMC - Nedlagte depoter",null,null,null,2,2,2,null,7,null,null,null,null,null,"CA328|7060A095",70,"acetone"]
[8,"KMC - Nordhavn",null,null,null,null,null,null,null,8,null,null,null,null,null,"CA328|C006C003",71,"isopropanol"]
[9,"Klintholm I/S",null,null,{"$f":"F127","v":"GulToner"},null,null,null,null,9,null,null,null,null,null,"CA328|F001F260",72,"1-propanol"]
[10,"Vejledning Nordjyllands Amt",null,null,{"$f":"G127","v":"Trafiklys5"},null,null,null,null,10,null,null,null,null,null,"CA328|LS000024",73,"diisopropylether"]
[11,"HB Jord",null,null,{"$f":"H127","v":"Trafiklys4"},null,null,null,null,11,null,null,null,null,null,"CA328|Z001JJ2D",74,"MEK"]
[null,null,null,null,null,null,null,null,null,12,null,null,null,null,null,"CA328|7059A006",75,"ethylacetat"]
[null,null,null,null,null,null,null,null,null,13,null,null,null,null,null,"CA328|Z001JJ4G",76,"methylacrylat"]
[null,null,null,null,null,null,null,null,null,14,null,null,null,null,null,"CA328|F001F225",77,"isobutanol"]
[null,null,null,null,null,null,null,null,null,15,null,null,null,null,null,"CA328|AA00002E",78,"isopropylacetat"]
["Kilde ID","Materialer",null,null,null,null,null,null,null,16,null,null,null,null,null,"CA328|F001F248",79,"1-butanol"]
["BYG1","Københavns kommune",null,null,"eLims databaser",null,null,null,null,17,null,null,null,null,null,"CA328|Z001JJ4N",80,"methylmetacrylat"]
["BYG2","Holstebro kommune",null,null,"Production",null,null,null,null,18,null,null,null,null,null,"CA328|F001F242",81,"MIBK"]
["BYG3","Sjællandsnetværket",null,null,"Training",null,null,null,null,19,null,null,null,null,null,"CA328|C003A356",82,"isobutylacetat"]
["BYG4","Odense Kommune",null,null,null,null,null,null,null,20,null,null,null,null,null,"CA328|C003A173",83,"butylacetat"]
["BYG5","Aalborg Portland ",null,null,null,null,null,null,null,21,null,null,null,null,null,"CA328|F001F339",84,"Vinylacetat"]
[null,null,null,null,null,null,null,null,null,22,null,null,null,null,null,"CA328|7060A028",85,"Acetaldehyd"]
[null,null,null,null,"ResSomNumerisk",null,null,null,null,23,null,null,null,null,null,"CA0EE|CA001452",86,"Sum af xylener"]
[null,null,null,null,"VLR62|PA00ERR","Antal Tons",null,null,null,24,null,null,null,null,null,"VL30V|CA001452",86,"Sum af xylener"]
[null,null,null,null,null,null,null,null,null,25,null,null,null,null,null,"CA142|F001F129",99,"Tørstof"]
[null,null,null,null,null,null,null,null,null,26,null,null,null,null,null,"CA101|7300G094",22,"Cyanid, total"]
[null,null,null,null,null,null,null,null,null,27,null,null,null,null,null,"CA102|F001F092",23,"Cyanid, syreflygtig"]
[null,null,null,null,null,null,null,null,null,28,null,null,null,null,null,"CAA46|7300A691",87,"Svovl, total"]
[null,null,null,null,null,null,null,null,null,29,null,null,null,null,null,"CA0EG|7300T015",88,"Chloroform"]
[null,null,null,null,null,null,null,null,null,30,null,null,null,null,null,"CA0EG|7300G080",89,"1,1,1-trichlorethan"]
[null,null,null,null,null,null,null,null,null,31,null,null,null,null,null,"CAF65|7300G094",90,"Cyanid, total"]
[null,null,null,null,null,null,null,null,null,32,null,null,null,null,null,"CA00R|7003A001",1,"Arsen"]
[null,null,null,null,null,null,null,null,null,33,null,null,null,null,null,"CA00W|7003A003",2,"Bly "]
[null,null,null,null,null,null,null,null,null,34,null,null,null,null,null,"CA00U|7001A010",6,"Kobber "]
[null,null,null,null,null,null,null,null,null,35,null,null,null,null,null,"CA00S|7003A016",3,"Cadmium"]
[null,null,null,null,null,null,null,null,null,36,null,null,null,null,null,"CA00T|7003A005",5,"Chrom total"]
[null,null,null,null,null,null,null,null,null,37,null,null,null,null,null,"CA00V|7003A007",8,"Nikkel"]
[null,null,null,null,null,null,null,null,null,38,null,null,null,null,null,"CA01C|7001A013",10,"Zink"]
[null,null,null,null,null,null,null,null,null,39,null,null,null,null,null,"CA143|7003A019",7,"Kviksølv"]
[null,null,null,null,null,null,null,null,null,40,null,null,null,null,null,"CA0S6|7300A036",91,"Pentachlorphenol"]
[null,null,null,null,null,null,null,null,null,41,null,null,null,null,null,"CAA29|7003A002",92,"Barium"]
[null,null,null,null,null,null,null,null,null,null,null,null,null,null,null,"EPHC3|MC000004",11,"Sum C6-C35 (Reflab1)"]
[null,null,null,null,null,null,null,null,null,42,null,null,null,null,null,"CA30H|MC000004",11,"Sum C6-C35 (Reflab1)"]
[null,null,null,null,null,null,null,null,null,null,null,null,null,null,null,"EPHC3|MC000007",12,"C6-C10 (Reflab1)"]
[null,null,null,null,null,null,null,null,null,43,null,null,null,null,null,"CA30H|MC000007",12,"C6-C10 (Reflab1)"]
[null,null,null,null,null,null,null,null,null,null,null,null,null,null,null,"EPHC3|CA001572",50,"C10-C15 (Reflab1)"]
[null,null,null,null,null,null,null,null,null,44,null,null,null,null,null,"CA30H|CA001572",50,"C10-C15 (Reflab1)"]
[null,null,null,null,null,null,null,null,null,null,null,null,null,null,null,"EPHC3|CA001573",49,"C15-C20 (Reflab1)"]
[null,null,null,null,null,null,null,null,null,45,null,null,null,null,null,"CA30H|CA001573",49,"C15-C20 (Reflab1)"]
[null,null,null,null,null,null,null,null,null,null,null,null,null,null,null,"EPHC3|CA00159R",48,"C20-C35 (Reflab1)"]
[null,null,null,null,null,null,null,null,null,46,null,null,null,null,null,"CA30H|CA00159R",48,"C20-C35 (Reflab1)"]
[null,null,null,null,null,null,null,null,null,null,null,null,null,null,null,"EPHC3|CA0015CV",52,"Sum C10-C20 (Reflab1)"]
[null,null,null,null,null,null,null,null,null,47,null,null,null,null,null,"CA30H|CA0015CV",52,"Sum C10-C20 (Reflab1)"]
[null,null,null,null,null,null,null,null,null,48,null,null,null,null,null,"VL601|GF00007W",93,"PCB(total)*5"]
[null,null,null,null,null,null,null,null,null,49,null,null,null,null,null,"VL60K|GF00007W",93,"PCB(total)*5"]
[null,null,null,null,null,null,null,null,null,50,null,null,null,null,null,"VL604|CY00208",94,"Chlorparaffiner C10-C13"]
[null,null,null,null,null,null,null,null,null,51,null,null,null,null,null,"VL604|CY00359Q",95,"Chlorparaffiner C14-C17"]
[null,null,null,null,null,null,null,null,null,52,null,null,null,null,null,"VL300|CA000213",96,"Asbest"]
[null,null,null,null,null,null,null,null,null,53,null,null,null,null,null,"VL003|CA001440",18,"Sum af 7 PAH'er"]
[null,null,null,null,null,null,null,null,null,54,null,null,null,null,null,"VL501|7003A003",2,"Bly "]
[null,null,null,null,null,null,null,null,null,null,null,null,null,null,null,"VL502|7003A016",3,"Cadmium"]
[null,null,null,null,null,null,null,null,null,55,null,null,null,null,null,"EP0GJ|7003A005",5,"Chrom total"]
[null,null,null,null,null,null,null,null,null,56,null,null,null,null,null,"VL503|7003A005",5,"Chrom total"]
[null,null,null,null,null,null,null,null,null,null,null,null,null,null,null,"VL504|7001A010",6,"Kobber "]
[null,null,null,null,null,null,null,null,null,null,null,null,null,null,null,"VL505|7003A019",7,"Kviksølv"]
[null,null,null,null,null,null,null,null,null,null,null,null,null,null,null,"VL506|7003A007",8,"Nikkel"]
[null,null,null,null,null,null,null,null,null,null,null,null,null,null,null,"VL507|7001A013",10,"Zink"]
[null,null,null,null,null,null,null,null,null,null,null,null,null,null,null,"VL04T|7003A001",1,"Arsen"]
[null,null,null,null,null,null,null,null,null,null,null,null,null,null,null,"VL50B|7003A001",1,"Arsen"]
[null,null,null,null,null,null,null,null,null,null,null,null,null,null,null,"VLBC0|7003A001",1,"Arsen"]
[null,null,null,null,null,null,null,null,null,null,null,null,null,null,null,"VL00T|7003A001",1,{"$f":"OFFSET($B$2,MATCH(Q198,$A$3:$A$114,1),0)","v":"Arsen"}]
[null,null,null,null,null,null,null,null,null,null,null,null,null,null,null,"VL00V|7003A003",2,"Bly "]
[null,null,null,null,null,null,null,null,null,null,null,null,null,null,null,"VL50B|7003A003",2,"Bly "]
[null,null,null,null,null,null,null,null,null,null,null,null,null,null,null,"EP0GK|7003A003",2,"Bly "]
[null,null,null,null,null,null,null,null,null,null,null,null,null,null,null,"VL04U|7003A003",2,"Bly "]
[null,null,null,null,null,null,null,null,null,null,null,null,null,null,null,"VLBD5|7003A003",2,"Bly "]
[null,null,null,null,null,null,null,null,null,null,null,null,null,null,null,"VL501|7003A003",2,"Bly "]
[null,null,null,null,null,null,null,null,null,null,null,null,null,null,null,"VL00M|7003A003",2,"Bly "]
[null,null,null,null,null,null,null,null,null,null,null,null,null,null,null,"VL015|7003A016",3,"Cadmium"]
[null,null,null,null,null,null,null,null,null,null,null,null,null,null,null,"VLBC5|7003A016",3,"Cadmium"]
[null,null,null,null,null,null,null,null,null,null,null,null,null,null,null,"VL04Y|7003A016",3,"Cadmium"]
[null,null,null,null,null,null,null,null,null,null,null,null,null,null,null,"VL50B|7003A016",3,"Cadmium"]
[null,null,null,null,null,null,null,null,null,null,null,null,null,null,null,"EP04X|7003A016",3,"Cadmium"]
[null,null,null,null,null,null,null,null,null,null,null,null,null,null,null,"VL502|7003A016",3,"Cadmium"]
[null,null,null,null,null,null,null,null,null,null,null,null,null,null,null,"VL00Q|7003A016",3,"Cadmium"]
[null,null,null,null,null,null,null,null,null,null,null,null,null,null,null,"VL04V|7003A005",5,"Chrom total"]
[null,null,null,null,null,null,null,null,null,null,null,null,null,null,null,"VLBD0|7003A005",5,"Chrom total"]
[null,null,null,null,null,null,null,null,null,null,null,null,null,null,null,"VL50B|7003A005",5,"Chrom total"]
[null,null,null,null,null,null,null,null,null,null,null,null,null,null,null,"VL00W|7003A005",5,"Chrom total"]
[null,null,null,null,null,null,null,null,null,null,null,null,null,null,null,"VL503|7003A005",5,"Chrom total"]
[null,null,null,null,null,null,null,null,null,null,null,null,null,null,null,"VL00N|7003A005",5,"Chrom total"]
[null,null,null,null,null,null,null,null,null,null,null,null,null,null,null,"VL50B|7001A010",6,"Kobber "]
[null,null,null,null,null,null,null,null,null,null,null,null,null,null,null,"VL050|7001A010",6,"Kobber "]
[null,null,null,null,null,null,null,null,null,null,null,null,null,null,null,"VLBA2|7001A010",6,"Kobber "]
[null,null,null,null,null,null,null,null,null,null,null,null,null,null,null,"VL01C|7001A010",6,"Kobber "]
[null,null,null,null,null,null,null,null,null,null,null,null,null,null,null,"VL504|7001A010",6,"Kobber "]
[null,null,null,null,null,null,null,null,null,null,null,null,null,null,null,"EP0H3|7001A010",6,"Kobber "]
[null,null,null,null,null,null,null,null,null,null,null,null,null,null,null,"VL00R|7001A010",6,"Kobber "]
[null,null,null,null,null,null,null,null,null,null,null,null,null,null,null,"VL50A|7003A019",7,"Kviksølv"]
[null,null,null,null,null,null,null,null,null,null,null,null,null,null,null,"VL511|7003A019",7,"Kviksølv"]
[null,null,null,null,null,null,null,null,null,null,null,null,null,null,null,"VL509|7003A019",7,"Kviksølv"]
[null,null,null,null,null,null,null,null,null,null,null,null,null,null,null,"VL00Y|7003A007",8,"Nikkel"]
[null,null,null,null,null,null,null,null,null,null,null,null,null,null,null,"VL50B|7003A007",8,"Nikkel"]
[null,null,null,null,null,null,null,null,null,null,null,null,null,null,null,"VL04W|7003A007",8,"Nikkel"]
[null,null,null,null,null,null,null,null,null,null,null,null,null,null,null,"VLBD7|7003A007",8,"Nikkel"]
[null,null,null,null,null,null,null,null,null,null,null,null,null,null,null,"EP0GM|7003A007",8,"Nikkel"]
[null,null,null,null,null,null,null,null,null,null,null,null,null,null,null,"VL506|7003A007",8,"Nikkel"]
[null,null,null,null,null,null,null,null,null,null,null,null,null,null,null,"VL00P|7003A007",8,"Nikkel"]
[null,null,null,null,null,null,null,null,null,null,null,null,null,null,null,"VL01E|7001A013",10,"Zink"]
[null,null,null,null,null,null,null,null,null,null,null,null,null,null,null,"VL051|7001A013",10,"Zink"]
[null,null,null,null,null,null,null,null,null,null,null,null,null,null,null,"VLB6T|7001A013",10,"Zink"]
[null,null,null,null,null,null,null,null,null,null,null,null,null,null,null,"VL50B|7001A013",10,"Zink"]
[null,null,null,null,null,null,null,null,null,null,null,null,null,null,null,"VL507|7001A013",10,"Zink"]
[null,null,null,null,null,null,null,null,null,null,null,null,null,null,null,"EP0HC|7001A013",10,"Zink"]
[null,null,null,null,null,null,null,null,null,null,null,null,null,null,null,"VL00S|7001A013",10,"Zink"]
[null,null,null,null,null,null,null,null,null,null,null,null,null,null,null,"VL010|7003A009",9,"Tin"]
[null,null,null,null,null,null,null,null,null,null,null,null,null,null,null,"VL052|7300A035",19,"Benz(a)pyren"]
[null,null,null,null,null,null,null,null,null,null,null,null,null,null,null,"EPAH5|7300A035",19,"Benz(a)pyren"]
[null,null,null,null,null,null,null,null,null,null,null,null,null,null,null,"VL302|7300A035",19,"Benz(a)pyren"]
[null,null,null,null,null,null,null,null,null,null,null,null,null,null,null,"VL30H|7300A124",16,"Benzen"]
[null,null,null,null,null,null,null,null,null,null,null,null,null,null,null,"VL30I|7300A124",16,"Benzen"]
[null,null,null,null,null,null,null,null,null,null,null,null,null,null,null,"VL304|7300A124",16,"Benzen"]
[null,null,null,null,null,null,null,null,null,null,null,null,null,null,null,"VL046|7300A124",16,"Benzen"]
[null,null,null,null,null,null,null,null,null,null,null,null,null,null,null,"VL054|7300A366",20,"Dibenz(a,h)anthracen"]
[null,null,null,null,null,null,null,null,null,null,null,null,null,null,null,"VL04I|7300A366",20,"Dibenz(a,h)anthracen"]
[null,null,null,null,null,null,null,null,null,null,null,null,null,null,null,"VL04L|7300G076",17,"Naphtalen"]
[null,null,null,null,null,null,null,null,null,null,null,null,null,null,null,"VL30J|7300G076",17,"Naphtalen"]
[null,null,null,null,null,null,null,null,null,null,null,null,null,null,null,"VL053|CA001440",18,"Sum af 7 PAH'er"]
[null,null,null,null,null,null,null,null,null,null,null,null,null,null,null,"VL04B|CA001440",18,"Sum af 7 PAH'er"]
[null,null,null,null,null,null,null,null,null,null,null,null,null,null,null,"EPAH5|CA001440",18,"Sum af 7 PAH'er"]
[null,null,null,null,null,null,null,null,null,null,null,null,null,null,null,"VL004|CA001442",18,"Sum af 7 PAH'er"]
[null,null,null,null,null,null,null,null,null,null,null,null,null,null,null,"VL309|CA001572",50,"C10-C15 (Reflab1)"]
[null,null,null,null,null,null,null,null,null,null,null,null,null,null,null,"VL30U|CA001572",50,"C10-C15 (Reflab1)"]
[null,null,null,null,null,null,null,null,null,null,null,null,null,null,null,"VL309|CA001573",49,"C15-C20 (Reflab1)"]
[null,null,null,null,null,null,null,null,null,null,null,null,null,null,null,"VL30U|CA001573",49,"C15-C20 (Reflab1)"]
[null,null,null,null,null,null,null,null,null,null,null,null,null,null,null,"VL309|CA00159R",48,"C20-C35 (Reflab1)"]
[null,null,null,null,null,null,null,null,null,null,null,null,null,null,null,"VL30U|CA00159R",48,"C20-C35 (Reflab1)"]
[null,null,null,null,null,null,null,null,null,null,null,null,null,null,null,"VL309|CA0015CV",52,"Sum C10-C20 (Reflab1)"]
[null,null,null,null,null,null,null,null,null,null,null,null,null,null,null,"VL30U|CA0015CV",52,"Sum C10-C20 (Reflab1)"]
[null,null,null,null,null,null,null,null,null,null,null,null,null,null,null,"VL304|F001F063",15,"BTEX, sum"]
[null,null,null,null,null,null,null,null,null,null,null,null,null,null,null,"VL044|F001F063",15,{"$f":"OFFSET($B$2,MATCH(Q268,$A$3:$A$114,1),0)","v":"BTEX, sum"}]
[null,null,null,null,null,null,null,null,null,null,null,null,null,null,null,"VL30H|F001F063",15,"BTEX, sum"]
[null,null,null,null,null,null,null,null,null,null,null,null,null,null,null,"VL30I|F001F063",15,"BTEX, sum"]
[null,null,null,null,null,null,null,null,null,null,null,null,null,null,null,"VL30V|F001F063",15,"BTEX, sum"]
[null,null,null,null,null,null,null,null,null,null,null,null,null,null,null,"VL309|MC000004",11,"Sum C6-C35 (Reflab1)"]
[null,null,null,null,null,null,null,null,null,null,null,null,null,null,null,"VL30U|MC000004",11,"Sum C6-C35 (Reflab1)"]
[null,null,null,null,null,null,null,null,null,null,null,null,null,null,null,"VL309|MC000007",12,"C6-C10 (Reflab1)"]
[null,null,null,null,null,null,null,null,null,null,null,null,null,null,null,"VL30U|MC000007",12,"C6-C10 (Reflab1)"]
[null,null,null,null,null,null,null,null,null,null,null,null,null,null,null,"VL04C|7300A035",19,"Benz(a)pyren"]
[null,null,null,null,null,null,null,null,null,null,null,null,null,null,null,"VL305|7300A035",19,"Benz(a)pyren"]
[null,null,null,null,null,null,null,null,null,null,null,null,null,null,null,"VL302|7300A366",20,"Dibenz(a,h)anthracen"]
[null,null,null,null,null,null,null,null,null,null,null,null,null,null,null,"VL305|7300A366",20,"Dibenz(a,h)anthracen"]
[null,null,null,null,null,null,null,null,null,null,null,null,null,null,null,"VL305|7300G076",17,"Naphtalen"]
[null,null,null,null,null,null,null,null,null,null,null,null,null,null,null,"VL302|CA001440",18,"Sum af 7 PAH'er"]
[null,null,null,null,null,null,null,null,null,null,null,null,null,null,null,"CA0EC|7300G076",17,"Naphtalen"]
[null,null,null,null,null,null,null,null,null,null,null,null,null,null,null,"CA0EC|7300A359",24,"Fluoranthen"]
[null,null,null,null,null,null,null,null,null,null,null,null,null,null,null,"CA0EC|GF00005X",25,"Benz(b+j+k)fluoranthen"]
[null,null,null,null,null,null,null,null,null,null,null,null,null,null,null,"CA0EC|7300A035",19,"Benz(a)pyren"]
[null,null,null,null,null,null,null,null,null,null,null,null,null,null,null,"CA0EC|7300A365",26,"Indeno(1,2,3-cd)pyren"]
[null,null,null,null,null,null,null,null,null,null,null,null,null,null,null,"EPAH5|7300A366",20,"Dibenz(a,h)anthracen"]
[null,null,null,null,null,null,null,null,null,null,null,null,null,null,null,"CA0EC|7300A366",20,"Dibenz(a,h)anthracen"]
[null,null,null,null,null,null,null,null,null,null,null,null,null,null,null,"EPAH5|7300A359",24,"Fluoranthen"]
[null,null,null,null,null,null,null,null,null,null,null,null,null,null,null,"VL04J|7300A359",24,"Fluoranthen"]
[null,null,null,null,null,null,null,null,null,null,null,null,null,null,null,"EPAH5|GF00005X",25,"Benz(b+j+k)fluoranthen"]
[null,null,null,null,null,null,null,null,null,null,null,null,null,null,null,"VL04N|GF00005X",25,"Benz(b+j+k)fluoranthen"]
[null,null,null,null,null,null,null,null,null,null,null,null,null,null,null,"EPAH5|7300A365",26,"Indeno(1,2,3-cd)pyren"]
[null,null,null,null,null,null,null,null,null,null,null,null,null,null,null,"VL04K|7300A365",26,"Indeno(1,2,3-cd)pyren"]
[null,null,null,null,null,null,null,null,null,null,null,null,null,null,null,"VL00L|7003A001",1,"Arsen"]
[null,null,null,null,null,null,null,null,null,null,null,null,null,null,null,"CA5FS|7300G093",4,"Chrom VI"]
[null,null,null,null,null,null,null,null,null,null,null,null,null,null,null,"AQAC1|AqAcute1",97,"Aquatic Acute 1(H400)"]
[null,null,null,null,null,null,null,null,null,null,null,null,null,null,null,"AQCH|AqAchro1",98,"Aquatic Chronic 1 (H410)"]
[]
[]
[]
[null,null,null,null,null,null,null,null,null,null,null,null,null,null,null,"Flurosil"]
[null,null,null,null,null,null,null,null,null,null,null,null,null,null,null,"CA31D|CA0015CV",52,"Sum C10-C20 (Reflab1)"]
[null,null,null,null,null,null,null,null,null,null,null,null,null,null,null,"CA31D|MC000007",12,"C6-C10 (Reflab1)"]
[null,null,null,null,null,null,null,null,null,null,null,null,null,null,null,"CA31D|CA001572",50,"C10-C15 (Reflab1)"]
[null,null,null,null,null,null,null,null,null,null,null,null,null,null,null,"CA31D|CA001573",49,"C15-C20 (Reflab1)"]
[null,null,null,null,null,null,null,null,null,null,null,null,null,null,null,"CA31D|CA00159R",48,"C20-C35 (Reflab1)"]
[null,null,null,null,null,null,null,null,null,null,null,null,null,null,null,"CA31D|MC000004",11,"Sum C6-C35 (Reflab1)"]

{"sheet":"1","index":4,"n_rows":102,"n_cols":7,"rows_kept":102,"cut":false,"hidden":true,"merged":[]}
["Vejledning Sjælland"]
[null,null,"<=","<=","<=","<=",">"]
["Parameter ID","Parameter","Klasse 0","Klasse 1","Klasse 2","Klasse 3","Klasse 4"]
[0,{"$f":"IF(Definitioner!B2<>\"\",Definitioner!B2,\"\")","v":"Dybde"}]
[1,{"$f":"IF(Definitioner!B3<>\"\",Definitioner!B3,\"\")","v":"Arsen"},10,20,20,50,50]
[2,{"$f":"IF(Definitioner!B4<>\"\",Definitioner!B4,\"\")","v":"Bly "},40,40,120,400,400]
[3,{"$f":"IF(Definitioner!B5<>\"\",Definitioner!B5,\"\")","v":"Cadmium"},0.5,0.5,1,5,5]
[4,{"$f":"IF(Definitioner!B6<>\"\",Definitioner!B6,\"\")","v":"Chrom VI"},2,20,35,50,50]
[5,{"$f":"IF(Definitioner!B7<>\"\",Definitioner!B7,\"\")","v":"Chrom total"},50,500,500,750,750]
[6,{"$f":"IF(Definitioner!B8<>\"\",Definitioner!B8,\"\")","v":"Kobber "},30,500,500,750,750]
[7,{"$f":"IF(Definitioner!B9<>\"\",Definitioner!B9,\"\")","v":"Kviksølv"},0.1,1,1,5,5]
[8,{"$f":"IF(Definitioner!B10<>\"\",Definitioner!B10,\"\")","v":"Nikkel"},15,30,40,100,100]
[9,{"$f":"IF(Definitioner!B11<>\"\",Definitioner!B11,\"\")","v":"Tin"},20,20,50,200,200]
[10,{"$f":"IF(Definitioner!B12<>\"\",Definitioner!B12,\"\")","v":"Zink"},100,500,500,1500,1500]
[11,{"$f":"IF(Definitioner!B13<>\"\",Definitioner!B13,\"\")","v":"Sum C6-C35 (Reflab1)"},100,100,200,300,300]
[12,{"$f":"IF(Definitioner!B14<>\"\",Definitioner!B14,\"\")","v":"C6-C10 (Reflab1)"},25,25,35,50,50]
[13,{"$f":"IF(Definitioner!B15<>\"\",Definitioner!B15,\"\")","v":"C10-C25 (Reflab1 gl.)"},50,50,75,100,100]
[14,{"$f":"IF(Definitioner!B16<>\"\",Definitioner!B16,\"\")","v":"C25-C35 (Reflab1 gl.)"},100,100,200,300,300]
[15,{"$f":"IF(Definitioner!B17<>\"\",Definitioner!B17,\"\")","v":"BTEX, sum"},0.6,0.6,10,15,15]
[16,{"$f":"IF(Definitioner!B18<>\"\",Definitioner!B18,\"\")","v":"Benzen"},0.1,0.1,1.5,2.5,2.5]
[17,{"$f":"IF(Definitioner!B19<>\"\",Definitioner!B19,\"\")","v":"Naphtalen"},0.5,0.5,1,10,10]
[18,{"$f":"IF(Definitioner!B20<>\"\",Definitioner!B20,\"\")","v":"Sum af 7 PAH'er"},1,4,15,75,75]
[19,{"$f":"IF(Definitioner!B21<>\"\",Definitioner!B21,\"\")","v":"Benz(a)pyren"},0.1,0.3,1,5,5]
[20,{"$f":"IF(Definitioner!B22<>\"\",Definitioner!B22,\"\")","v":"Dibenz(a,h)anthracen"},0.1,0.3,1,5,5]
[21,{"$f":"IF(Definitioner!B23<>\"\",Definitioner!B23,\"\")","v":"Phenoler, sum"},0.1,0.1,5,70,70]
[22,{"$f":"IF(Definitioner!B24<>\"\",Definitioner!B24,\"\")","v":"Cyanid, total"},5000,5000,500000,1000000,1000000]
[23,{"$f":"IF(Definitioner!B25<>\"\",Definitioner!B25,\"\")","v":"Cyanid, syreflygtig"},5000,5000,10000,100000,100000]
[24,{"$f":"IF(Definitioner!B26<>\"\",Definitioner!B26,\"\")","v":"Fluoranthen"}]
[25,{"$f":"IF(Definitioner!B27<>\"\",Definitioner!B27,\"\")","v":"Benz(b+j+k)fluoranthen"}]
[26,{"$f":"IF(Definitioner!B28<>\"\",Definitioner!B28,\"\")","v":"Indeno(1,2,3-cd)pyren"}]
[27,{"$f":"IF(Definitioner!B29<>\"\",Definitioner!B29,\"\")","v":"Chrom (bortset fra VI)"}]
[28,{"$f":"IF(Definitioner!B30<>\"\",Definitioner!B30,\"\")","v":"Sum C6-C40 (Reflab4)"},150,150,300,450,450]
[29,{"$f":"IF(Definitioner!B31<>\"\",Definitioner!B31,\"\")","v":"C6-C10 (Reflab4)"},25,25,35,50,50]
[30,{"$f":"IF(Definitioner!B32<>\"\",Definitioner!B32,\"\")","v":"C10-C20 (Reflab4)"},47,47,71,95,95]
[31,{"$f":"IF(Definitioner!B33<>\"\",Definitioner!B33,\"\")","v":"C10-C15 (Reflab4)"},20,20,30,40,40]
[32,{"$f":"IF(Definitioner!B34<>\"\",Definitioner!B34,\"\")","v":"C15-C20 (Reflab4)"},47,47,71,95,95]
[33,{"$f":"IF(Definitioner!B35<>\"\",Definitioner!B35,\"\")","v":"C20-C40 (Reflab4)"},150,150,300,450,450]
[34,{"$f":"IF(Definitioner!B36<>\"\",Definitioner!B36,\"\")","v":"Terpentin (C7-C12) (Reflab1)"}]
[35,{"$f":"IF(Definitioner!B37<>\"\",Definitioner!B37,\"\")","v":"Petroleum (C9-C16) (Reflab1)"}]
[36,{"$f":"IF(Definitioner!B38<>\"\",Definitioner!B38,\"\")","v":"Terpentin (C7-C12) (Reflab4)"}]
[37,{"$f":"IF(Definitioner!B39<>\"\",Definitioner!B39,\"\")","v":"Petroleum (C9-C16) (Reflab4)"}]
[39,{"$f":"IF(Definitioner!B40<>\"\",Definitioner!B40,\"\")","v":"Molybdæn"}]
[40,{"$f":"IF(Definitioner!B41<>\"\",Definitioner!B41,\"\")","v":"MTBE"}]
[41,{"$f":"IF(Definitioner!B42<>\"\",Definitioner!B42,\"\")","v":"Trichlorethylen"}]
[42,{"$f":"IF(Definitioner!B43<>\"\",Definitioner!B43,\"\")","v":"Tetrachlorethylen"}]
[43,{"$f":"IF(Definitioner!B44<>\"\",Definitioner!B44,\"\")","v":"Tetrachlormethan"}]
[44,{"$f":"IF(Definitioner!B45<>\"\",Definitioner!B45,\"\")","v":"Toluen"}]
[45,{"$f":"IF(Definitioner!B46<>\"\",Definitioner!B46,\"\")","v":"Ethylbenzen"}]
[46,{"$f":"IF(Definitioner!B47<>\"\",Definitioner!B47,\"\")","v":"o-Xylen"}]
[47,{"$f":"IF(Definitioner!B48<>\"\",Definitioner!B48,\"\")","v":"m+p-Xylen"}]
[48,{"$f":"IF(Definitioner!B49<>\"\",Definitioner!B49,\"\")","v":"C20-C35 (Reflab1)"},100,100,200,300,300]
[49,{"$f":"IF(Definitioner!B50<>\"\",Definitioner!B50,\"\")","v":"C15-C20 (Reflab1)"},55,55,83,110,110]
[50,{"$f":"IF(Definitioner!B51<>\"\",Definitioner!B51,\"\")","v":"C10-C15 (Reflab1)"},40,40,60,80,80]
[51,{"$f":"IF(Definitioner!B52<>\"\",Definitioner!B52,\"\")","v":"Sum C10-C20 (Reflab4)"},55,55,83,110,110]
[52,{"$f":"IF(Definitioner!B53<>\"\",Definitioner!B53,\"\")","v":"Sum C10-C20 (Reflab1)"},55,55,83,110,110]
[53,{"$f":"IF(Definitioner!B54<>\"\",Definitioner!B54,\"\")","v":"Vinylchlorid"}]
[54,{"$f":"IF(Definitioner!B55<>\"\",Definitioner!B55,\"\")","v":"1,1-dichlorethylen"}]
[55,{"$f":"IF(Definitioner!B56<>\"\",Definitioner!B56,\"\")","v":"trans-1,2-dichlorethylen"}]
[56,{"$f":"IF(Definitioner!B57<>\"\",Definitioner!B57,\"\")","v":"1,1-dichlorethan"}]
[57,{"$f":"IF(Definitioner!B58<>\"\",Definitioner!B58,\"\")","v":"cis-1,2-dichlorethylen"}]
[58,{"$f":"IF(Definitioner!B59<>\"\",Definitioner!B59,\"\")","v":"Dichlormethan"}]
[59,{"$f":"IF(Definitioner!B60<>\"\",Definitioner!B60,\"\")","v":"1,1,2-trichlorethan"}]
[60,{"$f":"IF(Definitioner!B61<>\"\",Definitioner!B61,\"\")","v":"1,2-dichlorethan"}]
[61,{"$f":"IF(Definitioner!B62<>\"\",Definitioner!B62,\"\")","v":"1,2-dibromethan"}]
[62,{"$f":"IF(Definitioner!B63<>\"\",Definitioner!B63,\"\")","v":"Chlorbenzen"}]
[63,{"$f":"IF(Definitioner!B64<>\"\",Definitioner!B64,\"\")","v":"1,2-dichlorbenzen"}]
[64,{"$f":"IF(Definitioner!B65<>\"\",Definitioner!B65,\"\")","v":"1,4-dichlorbenzen"}]
[65,{"$f":"IF(Definitioner!B66<>\"\",Definitioner!B66,\"\")","v":"Chlorethan"}]
[66,{"$f":"IF(Definitioner!B67<>\"\",Definitioner!B67,\"\")","v":"TBA (tert-butyl-alkohol)"}]
[67,{"$f":"IF(Definitioner!B68<>\"\",Definitioner!B68,\"\")","v":"methanol"}]
[68,{"$f":"IF(Definitioner!B69<>\"\",Definitioner!B69,\"\")","v":"Ethanol"}]
[69,{"$f":"IF(Definitioner!B70<>\"\",Definitioner!B70,\"\")","v":"diethylether"}]
[70,{"$f":"IF(Definitioner!B71<>\"\",Definitioner!B71,\"\")","v":"acetone"}]
[71,{"$f":"IF(Definitioner!B72<>\"\",Definitioner!B72,\"\")","v":"isopropanol"}]
[72,{"$f":"IF(Definitioner!B73<>\"\",Definitioner!B73,\"\")","v":"1-propanol"}]
[73,{"$f":"IF(Definitioner!B74<>\"\",Definitioner!B74,\"\")","v":"diisopropylether"}]
[74,{"$f":"IF(Definitioner!B75<>\"\",Definitioner!B75,\"\")","v":"MEK"}]
[75,{"$f":"IF(Definitioner!B76<>\"\",Definitioner!B76,\"\")","v":"ethylacetat"}]
[76,{"$f":"IF(Definitioner!B77<>\"\",Definitioner!B77,\"\")","v":"methylacrylat"}]
[77,{"$f":"IF(Definitioner!B78<>\"\",Definitioner!B78,\"\")","v":"isobutanol"}]
[78,{"$f":"IF(Definitioner!B79<>\"\",Definitioner!B79,\"\")","v":"isopropylacetat"}]
[79,{"$f":"IF(Definitioner!B80<>\"\",Definitioner!B80,\"\")","v":"1-butanol"}]
[80,{"$f":"IF(Definitioner!B81<>\"\",Definitioner!B81,\"\")","v":"methylmetacrylat"}]
[81,{"$f":"IF(Definitioner!B82<>\"\",Definitioner!B82,\"\")","v":"MIBK"}]
[82,{"$f":"IF(Definitioner!B83<>\"\",Definitioner!B83,\"\")","v":"isobutylacetat"}]
[83,{"$f":"IF(Definitioner!B84<>\"\",Definitioner!B84,\"\")","v":"butylacetat"}]
[84,{"$f":"IF(Definitioner!B85<>\"\",Definitioner!B85,\"\")","v":"Vinylacetat"}]
[85,{"$f":"IF(Definitioner!B86<>\"\",Definitioner!B86,\"\")","v":"Acetaldehyd"}]
[86,{"$f":"IF(Definitioner!B87<>\"\",Definitioner!B87,\"\")","v":"Sum af xylener"}]
[87,{"$f":"IF(Definitioner!B88<>\"\",Definitioner!B88,\"\")","v":"Svovl, total"}]
[88,{"$f":"IF(Definitioner!B89<>\"\",Definitioner!B89,\"\")","v":"Chloroform"}]
[89,{"$f":"IF(Definitioner!B90<>\"\",Definitioner!B90,\"\")","v":"1,1,1-trichlorethan"}]
[90,{"$f":"IF(Definitioner!B91<>\"\",Definitioner!B91,\"\")","v":"Cyanid, total"}]
[91,{"$f":"IF(Definitioner!B92<>\"\",Definitioner!B92,\"\")","v":"Pentachlorphenol"}]
[92,{"$f":"IF(Definitioner!B93<>\"\",Definitioner!B93,\"\")","v":"Barium"}]
[93,{"$f":"IF(Definitioner!B94<>\"\",Definitioner!B94,\"\")","v":"PCB(total)*5"}]
[94,{"$f":"IF(Definitioner!B95<>\"\",Definitioner!B95,\"\")","v":"Chlorparaffiner C10-C13"}]
[95,{"$f":"IF(Definitioner!B96<>\"\",Definitioner!B96,\"\")","v":"Chlorparaffiner C14-C17"}]
[96,{"$f":"IF(Definitioner!B97<>\"\",Definitioner!B97,\"\")","v":"Asbest"}]
[97,{"$f":"IF(Definitioner!B98<>\"\",Definitioner!B98,\"\")","v":"Aquatic Acute 1(H400)"}]
[98,{"$f":"IF(Definitioner!B99<>\"\",Definitioner!B99,\"\")","v":"Aquatic Chronic 1 (H410)"}]
[99,"Tørstof"]

{"sheet":"4","index":5,"n_rows":102,"n_cols":5,"rows_kept":102,"cut":false,"hidden":true,"merged":[]}
["BEK. 554","(Bekendtgørelse om definition af lettere forurenet jord, incl. udvalgte jordkvalitetskriterier)"]
[null,null,"<=","<=",">"]
["Parameter ID","Parameter","Uforurenet","Lettere forurenet","Kraftigere forurenet"]
[0,{"$f":"IF(Definitioner!B2<>\"\",Definitioner!B2,\"\")","v":"Dybde"}]
[1,{"$f":"IF(Definitioner!B3<>\"\",Definitioner!B3,\"\")","v":"Arsen"}]
[2,{"$f":"IF(Definitioner!B4<>\"\",Definitioner!B4,\"\")","v":"Bly "},40,400,400]
[3,{"$f":"IF(Definitioner!B5<>\"\",Definitioner!B5,\"\")","v":"Cadmium"},0.5,5,5]
[4,{"$f":"IF(Definitioner!B6<>\"\",Definitioner!B6,\"\")","v":"Chrom VI"}]
[5,{"$f":"IF(Definitioner!B7<>\"\",Definitioner!B7,\"\")","v":"Chrom total"},500,1000,1000]
[6,{"$f":"IF(Definitioner!B8<>\"\",Definitioner!B8,\"\")","v":"Kobber "},500,1000,1000]
[7,{"$f":"IF(Definitioner!B9<>\"\",Definitioner!B9,\"\")","v":"Kviksølv"},1,3,3]
[8,{"$f":"IF(Definitioner!B10<>\"\",Definitioner!B10,\"\")","v":"Nikkel"}]
[9,{"$f":"IF(Definitioner!B11<>\"\",Definitioner!B11,\"\")","v":"Tin"}]
[10,{"$f":"IF(Definitioner!B12<>\"\",Definitioner!B12,\"\")","v":"Zink"},500,1000,1000]
[11,{"$f":"IF(Definitioner!B13<>\"\",Definitioner!B13,\"\")","v":"Sum C6-C35 (Reflab1)"}]
[12,{"$f":"IF(Definitioner!B14<>\"\",Definitioner!B14,\"\")","v":"C6-C10 (Reflab1)"}]
[13,{"$f":"IF(Definitioner!B15<>\"\",Definitioner!B15,\"\")","v":"C10-C25 (Reflab1 gl.)"}]
[14,{"$f":"IF(Definitioner!B16<>\"\",Definitioner!B16,\"\")","v":"C25-C35 (Reflab1 gl.)"}]
[15,{"$f":"IF(Definitioner!B17<>\"\",Definitioner!B17,\"\")","v":"BTEX, sum"}]
[16,{"$f":"IF(Definitioner!B18<>\"\",Definitioner!B18,\"\")","v":"Benzen"}]
[17,{"$f":"IF(Definitioner!B19<>\"\",Definitioner!B19,\"\")","v":"Naphtalen"}]
[18,{"$f":"IF(Definitioner!B20<>\"\",Definitioner!B20,\"\")","v":"Sum af 7 PAH'er"},4,40,40]
[19,{"$f":"IF(Definitioner!B21<>\"\",Definitioner!B21,\"\")","v":"Benz(a)pyren"},0.3,3,3]
[20,{"$f":"IF(Definitioner!B22<>\"\",Definitioner!B22,\"\")","v":"Dibenz(a,h)anthracen"},0.3,3,3]
[21,{"$f":"IF(Definitioner!B23<>\"\",Definitioner!B23,\"\")","v":"Phenoler, sum"}]
[22,{"$f":"IF(Definitioner!B24<>\"\",Definitioner!B24,\"\")","v":"Cyanid, total"}]
[23,{"$f":"IF(Definitioner!B25<>\"\",Definitioner!B25,\"\")","v":"Cyanid, syreflygtig"}]
[24,{"$f":"IF(Definitioner!B26<>\"\",Definitioner!B26,\"\")","v":"Fluoranthen"}]
[25,{"$f":"IF(Definitioner!B27<>\"\",Definitioner!B27,\"\")","v":"Benz(b+j+k)fluoranthen"}]
[26,{"$f":"IF(Definitioner!B28<>\"\",Definitioner!B28,\"\")","v":"Indeno(1,2,3-cd)pyren"}]
[27,{"$f":"IF(Definitioner!B29<>\"\",Definitioner!B29,\"\")","v":"Chrom (bortset fra VI)"},500,1000,1000]
[28,{"$f":"IF(Definitioner!B30<>\"\",Definitioner!B30,\"\")","v":"Sum C6-C40 (Reflab4)"}]
[29,{"$f":"IF(Definitioner!B31<>\"\",Definitioner!B31,\"\")","v":"C6-C10 (Reflab4)"}]
[30,{"$f":"IF(Definitioner!B32<>\"\",Definitioner!B32,\"\")","v":"C10-C20 (Reflab4)"}]
[31,{"$f":"IF(Definitioner!B33<>\"\",Definitioner!B33,\"\")","v":"C10-C15 (Reflab4)"}]
[32,{"$f":"IF(Definitioner!B34<>\"\",Definitioner!B34,\"\")","v":"C15-C20 (Reflab4)"}]
[33,{"$f":"IF(Definitioner!B35<>\"\",Definitioner!B35,\"\")","v":"C20-C40 (Reflab4)"}]
[34,{"$f":"IF(Definitioner!B36<>\"\",Definitioner!B36,\"\")","v":"Terpentin (C7-C12) (Reflab1)"}]
[35,{"$f":"IF(Definitioner!B37<>\"\",Definitioner!B37,\"\")","v":"Petroleum (C9-C16) (Reflab1)"}]
[36,{"$f":"IF(Definitioner!B38<>\"\",Definitioner!B38,\"\")","v":"Terpentin (C7-C12) (Reflab4)"}]
[37,{"$f":"IF(Definitioner!B39<>\"\",Definitioner!B39,\"\")","v":"Petroleum (C9-C16) (Reflab4)"}]
[39,{"$f":"IF(Definitioner!B40<>\"\",Definitioner!B40,\"\")","v":"Molybdæn"}]
[40,{"$f":"IF(Definitioner!B41<>\"\",Definitioner!B41,\"\")","v":"MTBE"}]
[41,{"$f":"IF(Definitioner!B42<>\"\",Definitioner!B42,\"\")","v":"Trichlorethylen"}]
[42,{"$f":"IF(Definitioner!B43<>\"\",Definitioner!B43,\"\")","v":"Tetrachlorethylen"}]
[43,{"$f":"IF(Definitioner!B44<>\"\",Definitioner!B44,\"\")","v":"Tetrachlormethan"}]
[44,{"$f":"IF(Definitioner!B45<>\"\",Definitioner!B45,\"\")","v":"Toluen"}]
[45,{"$f":"IF(Definitioner!B46<>\"\",Definitioner!B46,\"\")","v":"Ethylbenzen"}]
[46,{"$f":"IF(Definitioner!B47<>\"\",Definitioner!B47,\"\")","v":"o-Xylen"}]
[47,{"$f":"IF(Definitioner!B48<>\"\",Definitioner!B48,\"\")","v":"m+p-Xylen"}]
[48,{"$f":"IF(Definitioner!B49<>\"\",Definitioner!B49,\"\")","v":"C20-C35 (Reflab1)"},100,300,300]
[49,{"$f":"IF(Definitioner!B50<>\"\",Definitioner!B50,\"\")","v":"C15-C20 (Reflab1)"}]
[50,{"$f":"IF(Definitioner!B51<>\"\",Definitioner!B51,\"\")","v":"C10-C15 (Reflab1)"}]
[51,{"$f":"IF(Definitioner!B52<>\"\",Definitioner!B52,\"\")","v":"Sum C10-C20 (Reflab4)"}]
[52,{"$f":"IF(Definitioner!B53<>\"\",Definitioner!B53,\"\")","v":"Sum C10-C20 (Reflab1)"}]
[53,{"$f":"IF(Definitioner!B54<>\"\",Definitioner!B54,\"\")","v":"Vinylchlorid"}]
[54,{"$f":"IF(Definitioner!B55<>\"\",Definitioner!B55,\"\")","v":"1,1-dichlorethylen"}]
[55,{"$f":"IF(Definitioner!B56<>\"\",Definitioner!B56,\"\")","v":"trans-1,2-dichlorethylen"}]
[56,{"$f":"IF(Definitioner!B57<>\"\",Definitioner!B57,\"\")","v":"1,1-dichlorethan"}]
[57,{"$f":"IF(Definitioner!B58<>\"\",Definitioner!B58,\"\")","v":"cis-1,2-dichlorethylen"}]
[58,{"$f":"IF(Definitioner!B59<>\"\",Definitioner!B59,\"\")","v":"Dichlormethan"}]
[59,{"$f":"IF(Definitioner!B60<>\"\",Definitioner!B60,\"\")","v":"1,1,2-trichlorethan"}]
[60,{"$f":"IF(Definitioner!B61<>\"\",Definitioner!B61,\"\")","v":"1,2-dichlorethan"}]
[61,{"$f":"IF(Definitioner!B62<>\"\",Definitioner!B62,\"\")","v":"1,2-dibromethan"}]
[62,{"$f":"IF(Definitioner!B63<>\"\",Definitioner!B63,\"\")","v":"Chlorbenzen"}]
[63,{"$f":"IF(Definitioner!B64<>\"\",Definitioner!B64,\"\")","v":"1,2-dichlorbenzen"}]
[64,{"$f":"IF(Definitioner!B65<>\"\",Definitioner!B65,\"\")","v":"1,4-dichlorbenzen"}]
[65,{"$f":"IF(Definitioner!B66<>\"\",Definitioner!B66,\"\")","v":"Chlorethan"}]
[66,{"$f":"IF(Definitioner!B67<>\"\",Definitioner!B67,\"\")","v":"TBA (tert-butyl-alkohol)"}]
[67,{"$f":"IF(Definitioner!B68<>\"\",Definitioner!B68,\"\")","v":"methanol"}]
[68,{"$f":"IF(Definitioner!B69<>\"\",Definitioner!B69,\"\")","v":"Ethanol"}]
[69,{"$f":"IF(Definitioner!B70<>\"\",Definitioner!B70,\"\")","v":"diethylether"}]
[70,{"$f":"IF(Definitioner!B71<>\"\",Definitioner!B71,\"\")","v":"acetone"}]
[71,{"$f":"IF(Definitioner!B72<>\"\",Definitioner!B72,\"\")","v":"isopropanol"}]
[72,{"$f":"IF(Definitioner!B73<>\"\",Definitioner!B73,\"\")","v":"1-propanol"}]
[73,{"$f":"IF(Definitioner!B74<>\"\",Definitioner!B74,\"\")","v":"diisopropylether"}]
[74,{"$f":"IF(Definitioner!B75<>\"\",Definitioner!B75,\"\")","v":"MEK"}]
[75,{"$f":"IF(Definitioner!B76<>\"\",Definitioner!B76,\"\")","v":"ethylacetat"}]
[76,{"$f":"IF(Definitioner!B77<>\"\",Definitioner!B77,\"\")","v":"methylacrylat"}]
[77,{"$f":"IF(Definitioner!B78<>\"\",Definitioner!B78,\"\")","v":"isobutanol"}]
[78,{"$f":"IF(Definitioner!B79<>\"\",Definitioner!B79,\"\")","v":"isopropylacetat"}]
[79,{"$f":"IF(Definitioner!B80<>\"\",Definitioner!B80,\"\")","v":"1-butanol"}]
[80,{"$f":"IF(Definitioner!B81<>\"\",Definitioner!B81,\"\")","v":"methylmetacrylat"}]
[81,{"$f":"IF(Definitioner!B82<>\"\",Definitioner!B82,\"\")","v":"MIBK"}]
[82,{"$f":"IF(Definitioner!B83<>\"\",Definitioner!B83,\"\")","v":"isobutylacetat"}]
[83,{"$f":"IF(Definitioner!B84<>\"\",Definitioner!B84,\"\")","v":"butylacetat"}]
[84,{"$f":"IF(Definitioner!B85<>\"\",Definitioner!B85,\"\")","v":"Vinylacetat"}]
[85,{"$f":"IF(Definitioner!B86<>\"\",Definitioner!B86,\"\")","v":"Acetaldehyd"}]
[86,{"$f":"IF(Definitioner!B87<>\"\",Definitioner!B87,\"\")","v":"Sum af xylener"}]
[87,{"$f":"IF(Definitioner!B88<>\"\",Definitioner!B88,\"\")","v":"Svovl, total"}]
[88,{"$f":"IF(Definitioner!B89<>\"\",Definitioner!B89,\"\")","v":"Chloroform"}]
[89,{"$f":"IF(Definitioner!B90<>\"\",Definitioner!B90,\"\")","v":"1,1,1-trichlorethan"}]
[90,{"$f":"IF(Definitioner!B91<>\"\",Definitioner!B91,\"\")","v":"Cyanid, total"}]
[91,{"$f":"IF(Definitioner!B92<>\"\",Definitioner!B92,\"\")","v":"Pentachlorphenol"}]
[92,{"$f":"IF(Definitioner!B93<>\"\",Definitioner!B93,\"\")","v":"Barium"}]
[93,{"$f":"IF(Definitioner!B94<>\"\",Definitioner!B94,\"\")","v":"PCB(total)*5"}]
[94,{"$f":"IF(Definitioner!B95<>\"\",Definitioner!B95,\"\")","v":"Chlorparaffiner C10-C13"}]
[95,{"$f":"IF(Definitioner!B96<>\"\",Definitioner!B96,\"\")","v":"Chlorparaffiner C14-C17"}]
[96,{"$f":"IF(Definitioner!B97<>\"\",Definitioner!B97,\"\")","v":"Asbest"}]
[97,{"$f":"IF(Definitioner!B98<>\"\",Definitioner!B98,\"\")","v":"Aquatic Acute 1(H400)"}]
[98,{"$f":"IF(Definitioner!B99<>\"\",Definitioner!B99,\"\")","v":"Aquatic Chronic 1 (H410)"}]
[99,{"$f":"IF(Definitioner!B100<>\"\",Definitioner!B100,\"\")","v":"Tørstof"}]

{"sheet":"BYG2","index":6,"n_rows":117,"n_cols":5,"rows_kept":117,"cut":false,"hidden":true,"merged":[]}
["Bygningsmaterialer, Holstebro kommune"]
[null,null,"<","<=",">"]
["Parameter ID","Parameter","Rent (Kat.1)","Forurenet (Kat.2)","Farligt affald (3)"]
[0,{"$f":"IF(Definitioner!B2<>\"\",Definitioner!B2,\"\")","v":"Dybde"}]
[1,{"$f":"IF(Definitioner!B3<>\"\",Definitioner!B3,\"\")","v":"Arsen"},20,1000,1000]
[2,{"$f":"IF(Definitioner!B4<>\"\",Definitioner!B4,\"\")","v":"Bly "},40,2500,2500]
[3,{"$f":"IF(Definitioner!B5<>\"\",Definitioner!B5,\"\")","v":"Cadmium"},"0,50",1000,1000]
[4,{"$f":"IF(Definitioner!B6<>\"\",Definitioner!B6,\"\")","v":"Chrom VI"},20,1000,1000]
[5,{"$f":"IF(Definitioner!B7<>\"\",Definitioner!B7,\"\")","v":"Chrom total"},500,1000,1000]
[6,{"$f":"IF(Definitioner!B8<>\"\",Definitioner!B8,\"\")","v":"Kobber "},500,2500,2500]
[7,{"$f":"IF(Definitioner!B9<>\"\",Definitioner!B9,\"\")","v":"Kviksølv"},"1,0",1000,1000]
[8,{"$f":"IF(Definitioner!B10<>\"\",Definitioner!B10,\"\")","v":"Nikkel"},30,1000,1000]
[9,{"$f":"IF(Definitioner!B11<>\"\",Definitioner!B11,\"\")","v":"Tin"}]
[10,{"$f":"IF(Definitioner!B12<>\"\",Definitioner!B12,\"\")","v":"Zink"},500,2500,2500]
[11,{"$f":"IF(Definitioner!B13<>\"\",Definitioner!B13,\"\")","v":"Sum C6-C35 (Reflab1)"}]
[12,{"$f":"IF(Definitioner!B14<>\"\",Definitioner!B14,\"\")","v":"C6-C10 (Reflab1)"}]
[13,{"$f":"IF(Definitioner!B15<>\"\",Definitioner!B15,\"\")","v":"C10-C25 (Reflab1 gl.)"}]
[14,{"$f":"IF(Definitioner!B16<>\"\",Definitioner!B16,\"\")","v":"C25-C35 (Reflab1 gl.)"}]
[15,{"$f":"IF(Definitioner!B17<>\"\",Definitioner!B17,\"\")","v":"BTEX, sum"}]
[16,{"$f":"IF(Definitioner!B18<>\"\",Definitioner!B18,\"\")","v":"Benzen"}]
[17,{"$f":"IF(Definitioner!B19<>\"\",Definitioner!B19,\"\")","v":"Naphtalen"}]
[18,{"$f":"IF(Definitioner!B20<>\"\",Definitioner!B20,\"\")","v":"Sum af 7 PAH'er"},"0,30",1000,1000]
[19,{"$f":"IF(Definitioner!B21<>\"\",Definitioner!B21,\"\")","v":"Benz(a)pyren"}]
[20,{"$f":"IF(Definitioner!B22<>\"\",Definitioner!B22,\"\")","v":"Dibenz(a,h)anthracen"}]
[21,{"$f":"IF(Definitioner!B23<>\"\",Definitioner!B23,\"\")","v":"Phenoler, sum"}]
[22,{"$f":"IF(Definitioner!B24<>\"\",Definitioner!B24,\"\")","v":"Cyanid, total"}]
[23,{"$f":"IF(Definitioner!B25<>\"\",Definitioner!B25,\"\")","v":"Cyanid, syreflygtig"}]
[24,{"$f":"IF(Definitioner!B26<>\"\",Definitioner!B26,\"\")","v":"Fluoranthen"}]
[25,{"$f":"IF(Definitioner!B27<>\"\",Definitioner!B27,\"\")","v":"Benz(b+j+k)fluoranthen"}]
[26,{"$f":"IF(Definitioner!B28<>\"\",Definitioner!B28,\"\")","v":"Indeno(1,2,3-cd)pyren"}]
[27,{"$f":"IF(Definitioner!B29<>\"\",Definitioner!B29,\"\")","v":"Chrom (bortset fra VI)"}]
[28,{"$f":"IF(Definitioner!B30<>\"\",Definitioner!B30,\"\")","v":"Sum C6-C40 (Reflab4)"}]
[29,{"$f":"IF(Definitioner!B31<>\"\",Definitioner!B31,\"\")","v":"C6-C10 (Reflab4)"}]
[30,{"$f":"IF(Definitioner!B32<>\"\",Definitioner!B32,\"\")","v":"C10-C20 (Reflab4)"}]
[31,{"$f":"IF(Definitioner!B33<>\"\",Definitioner!B33,\"\")","v":"C10-C15 (Reflab4)"}]
[32,{"$f":"IF(Definitioner!B34<>\"\",Definitioner!B34,\"\")","v":"C15-C20 (Reflab4)"}]
[33,{"$f":"IF(Definitioner!B35<>\"\",Definitioner!B35,\"\")","v":"C20-C40 (Reflab4)"}]
[34,{"$f":"IF(Definitioner!B36<>\"\",Definitioner!B36,\"\")","v":"Terpentin (C7-C12) (Reflab1)"}]
[35,{"$f":"IF(Definitioner!B37<>\"\",Definitioner!B37,\"\")","v":"Petroleum (C9-C16) (Reflab1)"}]
[36,{"$f":"IF(Definitioner!B38<>\"\",Definitioner!B38,\"\")","v":"Terpentin (C7-C12) (Reflab4)"}]
[37,{"$f":"IF(Definitioner!B39<>\"\",Definitioner!B39,\"\")","v":"Petroleum (C9-C16) (Reflab4)"}]
[39,{"$f":"IF(Definitioner!B40<>\"\",Definitioner!B40,\"\")","v":"Molybdæn"}]
[40,{"$f":"IF(Definitioner!B41<>\"\",Definitioner!B41,\"\")","v":"MTBE"}]
[41,{"$f":"IF(Definitioner!B42<>\"\",Definitioner!B42,\"\")","v":"Trichlorethylen"}]
[42,{"$f":"IF(Definitioner!B43<>\"\",Definitioner!B43,\"\")","v":"Tetrachlorethylen"}]
[43,{"$f":"IF(Definitioner!B44<>\"\",Definitioner!B44,\"\")","v":"Tetrachlormethan"}]
[44,{"$f":"IF(Definitioner!B45<>\"\",Definitioner!B45,\"\")","v":"Toluen"}]
[45,{"$f":"IF(Definitioner!B46<>\"\",Definitioner!B46,\"\")","v":"Ethylbenzen"}]
[46,{"$f":"IF(Definitioner!B47<>\"\",Definitioner!B47,\"\")","v":"o-Xylen"}]
[47,{"$f":"IF(Definitioner!B48<>\"\",Definitioner!B48,\"\")","v":"m+p-Xylen"}]
[48,{"$f":"IF(Definitioner!B49<>\"\",Definitioner!B49,\"\")","v":"C20-C35 (Reflab1)"}]
[49,{"$f":"IF(Definitioner!B50<>\"\",Definitioner!B50,\"\")","v":"C15-C20 (Reflab1)"}]
[50,{"$f":"IF(Definitioner!B51<>\"\",Definitioner!B51,\"\")","v":"C10-C15 (Reflab1)"}]
[51,{"$f":"IF(Definitioner!B52<>\"\",Definitioner!B52,\"\")","v":"Sum C10-C20 (Reflab4)"}]
[52,{"$f":"IF(Definitioner!B53<>\"\",Definitioner!B53,\"\")","v":"Sum C10-C20 (Reflab1)"}]
[53,{"$f":"IF(Definitioner!B54<>\"\",Definitioner!B54,\"\")","v":"Vinylchlorid"}]
[54,{"$f":"IF(Definitioner!B55<>\"\",Definitioner!B55,\"\")","v":"1,1-dichlorethylen"}]
[55,{"$f":"IF(Definitioner!B56<>\"\",Definitioner!B56,\"\")","v":"trans-1,2-dichlorethylen"}]
[56,{"$f":"IF(Definitioner!B57<>\"\",Definitioner!B57,\"\")","v":"1,1-dichlorethan"}]
[57,{"$f":"IF(Definitioner!B58<>\"\",Definitioner!B58,\"\")","v":"cis-1,2-dichlorethylen"}]
[58,{"$f":"IF(Definitioner!B59<>\"\",Definitioner!B59,\"\")","v":"Dichlormethan"}]
[59,{"$f":"IF(Definitioner!B60<>\"\",Definitioner!B60,\"\")","v":"1,1,2-trichlorethan"}]
[60,{"$f":"IF(Definitioner!B61<>\"\",Definitioner!B61,\"\")","v":"1,2-dichlorethan"}]
[61,{"$f":"IF(Definitioner!B62<>\"\",Definitioner!B62,\"\")","v":"1,2-dibromethan"}]
[62,{"$f":"IF(Definitioner!B63<>\"\",Definitioner!B63,\"\")","v":"Chlorbenzen"}]
[63,{"$f":"IF(Definitioner!B64<>\"\",Definitioner!B64,\"\")","v":"1,2-dichlorbenzen"}]
[64,{"$f":"IF(Definitioner!B65<>\"\",Definitioner!B65,\"\")","v":"1,4-dichlorbenzen"}]
[65,{"$f":"IF(Definitioner!B66<>\"\",Definitioner!B66,\"\")","v":"Chlorethan"}]
[66,{"$f":"IF(Definitioner!B67<>\"\",Definitioner!B67,\"\")","v":"TBA (tert-butyl-alkohol)"}]
[67,{"$f":"IF(Definitioner!B68<>\"\",Definitioner!B68,\"\")","v":"methanol"}]
[68,{"$f":"IF(Definitioner!B69<>\"\",Definitioner!B69,\"\")","v":"Ethanol"}]
[69,{"$f":"IF(Definitioner!B70<>\"\",Definitioner!B70,\"\")","v":"diethylether"}]
[70,{"$f":"IF(Definitioner!B71<>\"\",Definitioner!B71,\"\")","v":"acetone"}]
[71,{"$f":"IF(Definitioner!B72<>\"\",Definitioner!B72,\"\")","v":"isopropanol"}]
[72,{"$f":"IF(Definitioner!B73<>\"\",Definitioner!B73,\"\")","v":"1-propanol"}]
[73,{"$f":"IF(Definitioner!B74<>\"\",Definitioner!B74,\"\")","v":"diisopropylether"}]
[74,{"$f":"IF(Definitioner!B75<>\"\",Definitioner!B75,\"\")","v":"MEK"}]
[75,{"$f":"IF(Definitioner!B76<>\"\",Definitioner!B76,\"\")","v":"ethylacetat"}]
[76,{"$f":"IF(Definitioner!B77<>\"\",Definitioner!B77,\"\")","v":"methylacrylat"}]
[77,{"$f":"IF(Definitioner!B78<>\"\",Definitioner!B78,\"\")","v":"isobutanol"}]
[78,{"$f":"IF(Definitioner!B79<>\"\",Definitioner!B79,\"\")","v":"isopropylacetat"}]
[79,{"$f":"IF(Definitioner!B80<>\"\",Definitioner!B80,\"\")","v":"1-butanol"}]
[80,{"$f":"IF(Definitioner!B81<>\"\",Definitioner!B81,\"\")","v":"methylmetacrylat"}]
[81,{"$f":"IF(Definitioner!B82<>\"\",Definitioner!B82,\"\")","v":"MIBK"}]
[82,{"$f":"IF(Definitioner!B83<>\"\",Definitioner!B83,\"\")","v":"isobutylacetat"}]
[83,{"$f":"IF(Definitioner!B84<>\"\",Definitioner!B84,\"\")","v":"butylacetat"}]
[84,{"$f":"IF(Definitioner!B85<>\"\",Definitioner!B85,\"\")","v":"Vinylacetat"}]
[85,{"$f":"IF(Definitioner!B86<>\"\",Definitioner!B86,\"\")","v":"Acetaldehyd"}]
[86,{"$f":"IF(Definitioner!B87<>\"\",Definitioner!B87,\"\")","v":"Sum af xylener"}]
[87,{"$f":"IF(Definitioner!B88<>\"\",Definitioner!B88,\"\")","v":"Svovl, total"}]
[88,{"$f":"IF(Definitioner!B89<>\"\",Definitioner!B89,\"\")","v":"Chloroform"}]
[89,{"$f":"IF(Definitioner!B90<>\"\",Definitioner!B90,\"\")","v":"1,1,1-trichlorethan"}]
[90,{"$f":"IF(Definitioner!B91<>\"\",Definitioner!B91,\"\")","v":"Cyanid, total"}]
[91,{"$f":"IF(Definitioner!B92<>\"\",Definitioner!B92,\"\")","v":"Pentachlorphenol"}]
[92,{"$f":"IF(Definitioner!B93<>\"\",Definitioner!B93,\"\")","v":"Barium"}]
[93,{"$f":"IF(Definitioner!B94<>\"\",Definitioner!B94,\"\")","v":"PCB(total)*5"},"0,10",50,50]
[94,{"$f":"IF(Definitioner!B95<>\"\",Definitioner!B95,\"\")","v":"Chlorparaffiner C10-C13"},10000,10000,10000]
[95,{"$f":"IF(Definitioner!B96<>\"\",Definitioner!B96,\"\")","v":"Chlorparaffiner C14-C17"}]
[96,{"$f":"IF(Definitioner!B97<>\"\",Definitioner!B97,\"\")","v":"Asbest"},"Ikke påvist",null,"påvist"]
[97,{"$f":"IF(Definitioner!B98<>\"\",Definitioner!B98,\"\")","v":"Aquatic Acute 1(H400)"}]
[98,{"$f":"IF(Definitioner!B99<>\"\",Definitioner!B99,\"\")","v":"Aquatic Chronic 1 (H410)"}]
[99,{"$f":"IF(Definitioner!B100<>\"\",Definitioner!B100,\"\")","v":"Tørstof"}]
[100,{"$f":"IF(Definitioner!B101<>\"\",Definitioner!B101,\"\")","v":"Phenol"}]
[101,{"$f":"IF(Definitioner!B102<>\"\",Definitioner!B102,\"\")","v":"Cresol (sum)"}]
[102,{"$f":"IF(Definitioner!B103<>\"\",Definitioner!B103,\"\")","v":"Xylenols"}]
[103,{"$f":"IF(Definitioner!B104<>\"\",Definitioner!B104,\"\")","v":"2-Methylphenol"}]
[104,{"$f":"IF(Definitioner!B105<>\"\",Definitioner!B105,\"\")","v":"3-Methylphenol"}]
[105,{"$f":"IF(Definitioner!B106<>\"\",Definitioner!B106,\"\")","v":"4-Methylphenol"}]
[106,{"$f":"IF(Definitioner!B107<>\"\",Definitioner!B107,\"\")","v":"2,3-Dimethylphenol"}]
[107,{"$f":"IF(Definitioner!B108<>\"\",Definitioner!B108,\"\")","v":"2,4-Dimethylphenol"}]
[108,{"$f":"IF(Definitioner!B109<>\"\",Definitioner!B109,\"\")","v":"2,5-Dimethylphenol"}]
[109,{"$f":"IF(Definitioner!B110<>\"\",Definitioner!B110,\"\")","v":"2,6-Dimethylphenol"}]
[110,{"$f":"IF(Definitioner!B111<>\"\",Definitioner!B111,\"\")","v":"3,4-Dimethylphenol"}]
[111,{"$f":"IF(Definitioner!B112<>\"\",Definitioner!B112,\"\")","v":"3,5-Dimethylphenol"}]
[112,{"$f":"IF(Definitioner!B113<>\"\",Definitioner!B113,\"\")","v":"Kobolt(Co)"}]
[113,{"$f":"IF(Definitioner!B114<>\"\",Definitioner!B114,\"\")","v":"Mangan(Mn)"}]
[114,{"$f":"IF(Definitioner!B115<>\"\",Definitioner!B115,\"\")","v":"Vanadium(V)"}]

{"sheet":"BYG5","index":7,"n_rows":117,"n_cols":5,"rows_kept":117,"cut":false,"hidden":true,"merged":[]}
["Bygningsmaterialer, Aalborg Portland"]
[null,null,"<","<=",">"]
["Parameter ID","Parameter","Rent (Kat.1)","Forurenet (Kat.2)","Farligt affald (3)"]
[0,{"$f":"IF(Definitioner!B2<>\"\",Definitioner!B2,\"\")","v":"Dybde"}]
[1,{"$f":"IF(Definitioner!B3<>\"\",Definitioner!B3,\"\")","v":"Arsen"},1000,1000,1000]
[2,{"$f":"IF(Definitioner!B4<>\"\",Definitioner!B4,\"\")","v":"Bly "}]
[3,{"$f":"IF(Definitioner!B5<>\"\",Definitioner!B5,\"\")","v":"Cadmium"},30,30,30]
[4,{"$f":"IF(Definitioner!B6<>\"\",Definitioner!B6,\"\")","v":"Chrom VI"}]
[5,{"$f":"IF(Definitioner!B7<>\"\",Definitioner!B7,\"\")","v":"Chrom total"},200,200,200]
[6,{"$f":"IF(Definitioner!B8<>\"\",Definitioner!B8,\"\")","v":"Kobber "}]
[7,{"$f":"IF(Definitioner!B9<>\"\",Definitioner!B9,\"\")","v":"Kviksølv"}]
[8,{"$f":"IF(Definitioner!B10<>\"\",Definitioner!B10,\"\")","v":"Nikkel"}]
[9,{"$f":"IF(Definitioner!B11<>\"\",Definitioner!B11,\"\")","v":"Tin"}]
[10,{"$f":"IF(Definitioner!B12<>\"\",Definitioner!B12,\"\")","v":"Zink"}]
[11,{"$f":"IF(Definitioner!B13<>\"\",Definitioner!B13,\"\")","v":"Sum C6-C35 (Reflab1)"}]
[12,{"$f":"IF(Definitioner!B14<>\"\",Definitioner!B14,\"\")","v":"C6-C10 (Reflab1)"}]
[13,{"$f":"IF(Definitioner!B15<>\"\",Definitioner!B15,\"\")","v":"C10-C25 (Reflab1 gl.)"}]
[14,{"$f":"IF(Definitioner!B16<>\"\",Definitioner!B16,\"\")","v":"C25-C35 (Reflab1 gl.)"}]
[15,{"$f":"IF(Definitioner!B17<>\"\",Definitioner!B17,\"\")","v":"BTEX, sum"}]
[16,{"$f":"IF(Definitioner!B18<>\"\",Definitioner!B18,\"\")","v":"Benzen"}]
[17,{"$f":"IF(Definitioner!B19<>\"\",Definitioner!B19,\"\")","v":"Naphtalen"}]
[18,{"$f":"IF(Definitioner!B20<>\"\",Definitioner!B20,\"\")","v":"Sum af 7 PAH'er"}]
[19,{"$f":"IF(Definitioner!B21<>\"\",Definitioner!B21,\"\")","v":"Benz(a)pyren"}]
[20,{"$f":"IF(Definitioner!B22<>\"\",Definitioner!B22,\"\")","v":"Dibenz(a,h)anthracen"}]
[21,{"$f":"IF(Definitioner!B23<>\"\",Definitioner!B23,\"\")","v":"Phenoler, sum"}]
[22,{"$f":"IF(Definitioner!B24<>\"\",Definitioner!B24,\"\")","v":"Cyanid, total"}]
[23,{"$f":"IF(Definitioner!B25<>\"\",Definitioner!B25,\"\")","v":"Cyanid, syreflygtig"}]
[24,{"$f":"IF(Definitioner!B26<>\"\",Definitioner!B26,\"\")","v":"Fluoranthen"}]
[25,{"$f":"IF(Definitioner!B27<>\"\",Definitioner!B27,\"\")","v":"Benz(b+j+k)fluoranthen"}]
[26,{"$f":"IF(Definitioner!B28<>\"\",Definitioner!B28,\"\")","v":"Indeno(1,2,3-cd)pyren"}]
[27,{"$f":"IF(Definitioner!B29<>\"\",Definitioner!B29,\"\")","v":"Chrom (bortset fra VI)"}]
[28,{"$f":"IF(Definitioner!B30<>\"\",Definitioner!B30,\"\")","v":"Sum C6-C40 (Reflab4)"}]
[29,{"$f":"IF(Definitioner!B31<>\"\",Definitioner!B31,\"\")","v":"C6-C10 (Reflab4)"}]
[30,{"$f":"IF(Definitioner!B32<>\"\",Definitioner!B32,\"\")","v":"C10-C20 (Reflab4)"}]
[31,{"$f":"IF(Definitioner!B33<>\"\",Definitioner!B33,\"\")","v":"C10-C15 (Reflab4)"}]
[32,{"$f":"IF(Definitioner!B34<>\"\",Definitioner!B34,\"\")","v":"C15-C20 (Reflab4)"}]
[33,{"$f":"IF(Definitioner!B35<>\"\",Definitioner!B35,\"\")","v":"C20-C40 (Reflab4)"}]
[34,{"$f":"IF(Definitioner!B36<>\"\",Definitioner!B36,\"\")","v":"Terpentin (C7-C12) (Reflab1)"}]
[35,{"$f":"IF(Definitioner!B37<>\"\",Definitioner!B37,\"\")","v":"Petroleum (C9-C16) (Reflab1)"}]
[36,{"$f":"IF(Definitioner!B38<>\"\",Definitioner!B38,\"\")","v":"Terpentin (C7-C12) (Reflab4)"}]
[37,{"$f":"IF(Definitioner!B39<>\"\",Definitioner!B39,\"\")","v":"Petroleum (C9-C16) (Reflab4)"}]
[39,{"$f":"IF(Definitioner!B40<>\"\",Definitioner!B40,\"\")","v":"Molybdæn"}]
[40,{"$f":"IF(Definitioner!B41<>\"\",Definitioner!B41,\"\")","v":"MTBE"}]
[41,{"$f":"IF(Definitioner!B42<>\"\",Definitioner!B42,\"\")","v":"Trichlorethylen"}]
[42,{"$f":"IF(Definitioner!B43<>\"\",Definitioner!B43,\"\")","v":"Tetrachlorethylen"}]
[43,{"$f":"IF(Definitioner!B44<>\"\",Definitioner!B44,\"\")","v":"Tetrachlormethan"}]
[44,{"$f":"IF(Definitioner!B45<>\"\",Definitioner!B45,\"\")","v":"Toluen"}]
[45,{"$f":"IF(Definitioner!B46<>\"\",Definitioner!B46,\"\")","v":"Ethylbenzen"}]
[46,{"$f":"IF(Definitioner!B47<>\"\",Definitioner!B47,\"\")","v":"o-Xylen"}]
[47,{"$f":"IF(Definitioner!B48<>\"\",Definitioner!B48,\"\")","v":"m+p-Xylen"}]
[48,{"$f":"IF(Definitioner!B49<>\"\",Definitioner!B49,\"\")","v":"C20-C35 (Reflab1)"}]
[49,{"$f":"IF(Definitioner!B50<>\"\",Definitioner!B50,\"\")","v":"C15-C20 (Reflab1)"}]
[50,{"$f":"IF(Definitioner!B51<>\"\",Definitioner!B51,\"\")","v":"C10-C15 (Reflab1)"}]
[51,{"$f":"IF(Definitioner!B52<>\"\",Definitioner!B52,\"\")","v":"Sum C10-C20 (Reflab4)"}]
[52,{"$f":"IF(Definitioner!B53<>\"\",Definitioner!B53,\"\")","v":"Sum C10-C20 (Reflab1)"}]
[53,{"$f":"IF(Definitioner!B54<>\"\",Definitioner!B54,\"\")","v":"Vinylchlorid"}]
[54,{"$f":"IF(Definitioner!B55<>\"\",Definitioner!B55,\"\")","v":"1,1-dichlorethylen"}]
[55,{"$f":"IF(Definitioner!B56<>\"\",Definitioner!B56,\"\")","v":"trans-1,2-dichlorethylen"}]
[56,{"$f":"IF(Definitioner!B57<>\"\",Definitioner!B57,\"\")","v":"1,1-dichlorethan"}]
[57,{"$f":"IF(Definitioner!B58<>\"\",Definitioner!B58,\"\")","v":"cis-1,2-dichlorethylen"}]
[58,{"$f":"IF(Definitioner!B59<>\"\",Definitioner!B59,\"\")","v":"Dichlormethan"}]
[59,{"$f":"IF(Definitioner!B60<>\"\",Definitioner!B60,\"\")","v":"1,1,2-trichlorethan"}]
[60,{"$f":"IF(Definitioner!B61<>\"\",Definitioner!B61,\"\")","v":"1,2-dichlorethan"}]
[61,{"$f":"IF(Definitioner!B62<>\"\",Definitioner!B62,\"\")","v":"1,2-dibromethan"}]
[62,{"$f":"IF(Definitioner!B63<>\"\",Definitioner!B63,\"\")","v":"Chlorbenzen"}]
[63,{"$f":"IF(Definitioner!B64<>\"\",Definitioner!B64,\"\")","v":"1,2-dichlorbenzen"}]
[64,{"$f":"IF(Definitioner!B65<>\"\",Definitioner!B65,\"\")","v":"1,4-dichlorbenzen"}]
[65,{"$f":"IF(Definitioner!B66<>\"\",Definitioner!B66,\"\")","v":"Chlorethan"}]
[66,{"$f":"IF(Definitioner!B67<>\"\",Definitioner!B67,\"\")","v":"TBA (tert-butyl-alkohol)"}]
[67,{"$f":"IF(Definitioner!B68<>\"\",Definitioner!B68,\"\")","v":"methanol"}]
[68,{"$f":"IF(Definitioner!B69<>\"\",Definitioner!B69,\"\")","v":"Ethanol"}]
[69,{"$f":"IF(Definitioner!B70<>\"\",Definitioner!B70,\"\")","v":"diethylether"}]
[70,{"$f":"IF(Definitioner!B71<>\"\",Definitioner!B71,\"\")","v":"acetone"}]
[71,{"$f":"IF(Definitioner!B72<>\"\",Definitioner!B72,\"\")","v":"isopropanol"}]
[72,{"$f":"IF(Definitioner!B73<>\"\",Definitioner!B73,\"\")","v":"1-propanol"}]
[73,{"$f":"IF(Definitioner!B74<>\"\",Definitioner!B74,\"\")","v":"diisopropylether"}]
[74,{"$f":"IF(Definitioner!B75<>\"\",Definitioner!B75,\"\")","v":"MEK"}]
[75,{"$f":"IF(Definitioner!B76<>\"\",Definitioner!B76,\"\")","v":"ethylacetat"}]
[76,{"$f":"IF(Definitioner!B77<>\"\",Definitioner!B77,\"\")","v":"methylacrylat"}]
[77,{"$f":"IF(Definitioner!B78<>\"\",Definitioner!B78,\"\")","v":"isobutanol"}]
[78,{"$f":"IF(Definitioner!B79<>\"\",Definitioner!B79,\"\")","v":"isopropylacetat"}]
[79,{"$f":"IF(Definitioner!B80<>\"\",Definitioner!B80,\"\")","v":"1-butanol"}]
[80,{"$f":"IF(Definitioner!B81<>\"\",Definitioner!B81,\"\")","v":"methylmetacrylat"}]
[81,{"$f":"IF(Definitioner!B82<>\"\",Definitioner!B82,\"\")","v":"MIBK"}]
[82,{"$f":"IF(Definitioner!B83<>\"\",Definitioner!B83,\"\")","v":"isobutylacetat"}]
[83,{"$f":"IF(Definitioner!B84<>\"\",Definitioner!B84,\"\")","v":"butylacetat"}]
[84,{"$f":"IF(Definitioner!B85<>\"\",Definitioner!B85,\"\")","v":"Vinylacetat"}]
[85,{"$f":"IF(Definitioner!B86<>\"\",Definitioner!B86,\"\")","v":"Acetaldehyd"}]
[86,{"$f":"IF(Definitioner!B87<>\"\",Definitioner!B87,\"\")","v":"Sum af xylener"}]
[87,{"$f":"IF(Definitioner!B88<>\"\",Definitioner!B88,\"\")","v":"Svovl, total"}]
[88,{"$f":"IF(Definitioner!B89<>\"\",Definitioner!B89,\"\")","v":"Chloroform"}]
[89,{"$f":"IF(Definitioner!B90<>\"\",Definitioner!B90,\"\")","v":"1,1,1-trichlorethan"}]
[90,{"$f":"IF(Definitioner!B91<>\"\",Definitioner!B91,\"\")","v":"Cyanid, total"}]
[91,{"$f":"IF(Definitioner!B92<>\"\",Definitioner!B92,\"\")","v":"Pentachlorphenol"}]
[92,{"$f":"IF(Definitioner!B93<>\"\",Definitioner!B93,\"\")","v":"Barium"},1000,1000,1000]
[93,{"$f":"IF(Definitioner!B94<>\"\",Definitioner!B94,\"\")","v":"PCB(total)*5"}]
[94,{"$f":"IF(Definitioner!B95<>\"\",Definitioner!B95,\"\")","v":"Chlorparaffiner C10-C13"}]
[95,{"$f":"IF(Definitioner!B96<>\"\",Definitioner!B96,\"\")","v":"Chlorparaffiner C14-C17"}]
[96,{"$f":"IF(Definitioner!B97<>\"\",Definitioner!B97,\"\")","v":"Asbest"}]
[97,{"$f":"IF(Definitioner!B98<>\"\",Definitioner!B98,\"\")","v":"Aquatic Acute 1(H400)"}]
[98,{"$f":"IF(Definitioner!B99<>\"\",Definitioner!B99,\"\")","v":"Aquatic Chronic 1 (H410)"}]
[99,{"$f":"IF(Definitioner!B100<>\"\",Definitioner!B100,\"\")","v":"Tørstof"}]
[100,{"$f":"IF(Definitioner!B101<>\"\",Definitioner!B101,\"\")","v":"Phenol"}]
[101,{"$f":"IF(Definitioner!B102<>\"\",Definitioner!B102,\"\")","v":"Cresol (sum)"}]
[102,{"$f":"IF(Definitioner!B103<>\"\",Definitioner!B103,\"\")","v":"Xylenols"}]
[103,{"$f":"IF(Definitioner!B104<>\"\",Definitioner!B104,\"\")","v":"2-Methylphenol"}]
[104,{"$f":"IF(Definitioner!B105<>\"\",Definitioner!B105,\"\")","v":"3-Methylphenol"}]
[105,{"$f":"IF(Definitioner!B106<>\"\",Definitioner!B106,\"\")","v":"4-Methylphenol"}]
[106,{"$f":"IF(Definitioner!B107<>\"\",Definitioner!B107,\"\")","v":"2,3-Dimethylphenol"}]
[107,{"$f":"IF(Definitioner!B108<>\"\",Definitioner!B108,\"\")","v":"2,4-Dimethylphenol"}]
[108,{"$f":"IF(Definitioner!B109<>\"\",Definitioner!B109,\"\")","v":"2,5-Dimethylphenol"}]
[109,{"$f":"IF(Definitioner!B110<>\"\",Definitioner!B110,\"\")","v":"2,6-Dimethylphenol"}]
[110,{"$f":"IF(Definitioner!B111<>\"\",Definitioner!B111,\"\")","v":"3,4-Dimethylphenol"}]
[111,{"$f":"IF(Definitioner!B112<>\"\",Definitioner!B112,\"\")","v":"3,5-Dimethylphenol"}]
[112,{"$f":"IF(Definitioner!B113<>\"\",Definitioner!B113,\"\")","v":"Kobolt(Co)"},1000,1000,1000]
[113,{"$f":"IF(Definitioner!B114<>\"\",Definitioner!B114,\"\")","v":"Mangan(Mn)"},1000,1000,1000]
[114,{"$f":"IF(Definitioner!B115<>\"\",Definitioner!B115,\"\")","v":"Vanadium(V)"},550,550,550]

{"sheet":"BYG4","index":8,"n_rows":117,"n_cols":5,"rows_kept":117,"cut":false,"hidden":true,"merged":[]}
["Bygningsmaterialer, Odense Kommune"]
[null,null,"<","<=",">"]
["Parameter ID","Parameter","Rent (Kat.1)","Forurenet (Kat.2)","Farligt affald (3)"]
[0,{"$f":"IF(Definitioner!B2<>\"\",Definitioner!B2,\"\")","v":"Dybde"}]
[1,{"$f":"IF(Definitioner!B3<>\"\",Definitioner!B3,\"\")","v":"Arsen"},20,1000,1000]
[2,{"$f":"IF(Definitioner!B4<>\"\",Definitioner!B4,\"\")","v":"Bly "},40,2500,2500]
[3,{"$f":"IF(Definitioner!B5<>\"\",Definitioner!B5,\"\")","v":"Cadmium"},"0,50",1000,1000]
[4,{"$f":"IF(Definitioner!B6<>\"\",Definitioner!B6,\"\")","v":"Chrom VI"},20,1000,1000]
[5,{"$f":"IF(Definitioner!B7<>\"\",Definitioner!B7,\"\")","v":"Chrom total"},500,1000,1000]
[6,{"$f":"IF(Definitioner!B8<>\"\",Definitioner!B8,\"\")","v":"Kobber "},500,2500,2500]
[7,{"$f":"IF(Definitioner!B9<>\"\",Definitioner!B9,\"\")","v":"Kviksølv"},"1,0",500,500]
[8,{"$f":"IF(Definitioner!B10<>\"\",Definitioner!B10,\"\")","v":"Nikkel"},30,1000,1000]
[9,{"$f":"IF(Definitioner!B11<>\"\",Definitioner!B11,\"\")","v":"Tin"}]
[10,{"$f":"IF(Definitioner!B12<>\"\",Definitioner!B12,\"\")","v":"Zink"},500,2500,2500]
[11,{"$f":"IF(Definitioner!B13<>\"\",Definitioner!B13,\"\")","v":"Sum C6-C35 (Reflab1)"}]
[12,{"$f":"IF(Definitioner!B14<>\"\",Definitioner!B14,\"\")","v":"C6-C10 (Reflab1)"}]
[13,{"$f":"IF(Definitioner!B15<>\"\",Definitioner!B15,\"\")","v":"C10-C25 (Reflab1 gl.)"}]
[14,{"$f":"IF(Definitioner!B16<>\"\",Definitioner!B16,\"\")","v":"C25-C35 (Reflab1 gl.)"}]
[15,{"$f":"IF(Definitioner!B17<>\"\",Definitioner!B17,\"\")","v":"BTEX, sum"}]
[16,{"$f":"IF(Definitioner!B18<>\"\",Definitioner!B18,\"\")","v":"Benzen"}]
[17,{"$f":"IF(Definitioner!B19<>\"\",Definitioner!B19,\"\")","v":"Naphtalen"}]
[18,{"$f":"IF(Definitioner!B20<>\"\",Definitioner!B20,\"\")","v":"Sum af 7 PAH'er"},4,1000,1000]
[19,{"$f":"IF(Definitioner!B21<>\"\",Definitioner!B21,\"\")","v":"Benz(a)pyren"},0.3,100,100]
[20,{"$f":"IF(Definitioner!B22<>\"\",Definitioner!B22,\"\")","v":"Dibenz(a,h)anthracen"},0.3,25,25]
[21,{"$f":"IF(Definitioner!B23<>\"\",Definitioner!B23,\"\")","v":"Phenoler, sum"}]
[22,{"$f":"IF(Definitioner!B24<>\"\",Definitioner!B24,\"\")","v":"Cyanid, total"},1000,1000,1000]
[23,{"$f":"IF(Definitioner!B25<>\"\",Definitioner!B25,\"\")","v":"Cyanid, syreflygtig"}]
[24,{"$f":"IF(Definitioner!B26<>\"\",Definitioner!B26,\"\")","v":"Fluoranthen"}]
[25,{"$f":"IF(Definitioner!B27<>\"\",Definitioner!B27,\"\")","v":"Benz(b+j+k)fluoranthen"}]
[26,{"$f":"IF(Definitioner!B28<>\"\",Definitioner!B28,\"\")","v":"Indeno(1,2,3-cd)pyren"}]
[27,{"$f":"IF(Definitioner!B29<>\"\",Definitioner!B29,\"\")","v":"Chrom (bortset fra VI)"}]
[28,{"$f":"IF(Definitioner!B30<>\"\",Definitioner!B30,\"\")","v":"Sum C6-C40 (Reflab4)"}]
[29,{"$f":"IF(Definitioner!B31<>\"\",Definitioner!B31,\"\")","v":"C6-C10 (Reflab4)"}]
[30,{"$f":"IF(Definitioner!B32<>\"\",Definitioner!B32,\"\")","v":"C10-C20 (Reflab4)"}]
[31,{"$f":"IF(Definitioner!B33<>\"\",Definitioner!B33,\"\")","v":"C10-C15 (Reflab4)"}]
[32,{"$f":"IF(Definitioner!B34<>\"\",Definitioner!B34,\"\")","v":"C15-C20 (Reflab4)"}]
[33,{"$f":"IF(Definitioner!B35<>\"\",Definitioner!B35,\"\")","v":"C20-C40 (Reflab4)"}]
[34,{"$f":"IF(Definitioner!B36<>\"\",Definitioner!B36,\"\")","v":"Terpentin (C7-C12) (Reflab1)"}]
[35,{"$f":"IF(Definitioner!B37<>\"\",Definitioner!B37,\"\")","v":"Petroleum (C9-C16) (Reflab1)"}]
[36,{"$f":"IF(Definitioner!B38<>\"\",Definitioner!B38,\"\")","v":"Terpentin (C7-C12) (Reflab4)"}]
[37,{"$f":"IF(Definitioner!B39<>\"\",Definitioner!B39,\"\")","v":"Petroleum (C9-C16) (Reflab4)"}]
[39,{"$f":"IF(Definitioner!B40<>\"\",Definitioner!B40,\"\")","v":"Molybdæn"}]
[40,{"$f":"IF(Definitioner!B41<>\"\",Definitioner!B41,\"\")","v":"MTBE"}]
[41,{"$f":"IF(Definitioner!B42<>\"\",Definitioner!B42,\"\")","v":"Trichlorethylen"}]
[42,{"$f":"IF(Definitioner!B43<>\"\",Definitioner!B43,\"\")","v":"Tetrachlorethylen"}]
[43,{"$f":"IF(Definitioner!B44<>\"\",Definitioner!B44,\"\")","v":"Tetrachlormethan"}]
[44,{"$f":"IF(Definitioner!B45<>\"\",Definitioner!B45,\"\")","v":"Toluen"}]
[45,{"$f":"IF(Definitioner!B46<>\"\",Definitioner!B46,\"\")","v":"Ethylbenzen"}]
[46,{"$f":"IF(Definitioner!B47<>\"\",Definitioner!B47,\"\")","v":"o-Xylen"}]
[47,{"$f":"IF(Definitioner!B48<>\"\",Definitioner!B48,\"\")","v":"m+p-Xylen"}]
[48,{"$f":"IF(Definitioner!B49<>\"\",Definitioner!B49,\"\")","v":"C20-C35 (Reflab1)"}]
[49,{"$f":"IF(Definitioner!B50<>\"\",Definitioner!B50,\"\")","v":"C15-C20 (Reflab1)"}]
[50,{"$f":"IF(Definitioner!B51<>\"\",Definitioner!B51,\"\")","v":"C10-C15 (Reflab1)"}]
[51,{"$f":"IF(Definitioner!B52<>\"\",Definitioner!B52,\"\")","v":"Sum C10-C20 (Reflab4)"}]
[52,{"$f":"IF(Definitioner!B53<>\"\",Definitioner!B53,\"\")","v":"Sum C10-C20 (Reflab1)"}]
[53,{"$f":"IF(Definitioner!B54<>\"\",Definitioner!B54,\"\")","v":"Vinylchlorid"}]
[54,{"$f":"IF(Definitioner!B55<>\"\",Definitioner!B55,\"\")","v":"1,1-dichlorethylen"}]
[55,{"$f":"IF(Definitioner!B56<>\"\",Definitioner!B56,\"\")","v":"trans-1,2-dichlorethylen"}]
[56,{"$f":"IF(Definitioner!B57<>\"\",Definitioner!B57,\"\")","v":"1,1-dichlorethan"}]
[57,{"$f":"IF(Definitioner!B58<>\"\",Definitioner!B58,\"\")","v":"cis-1,2-dichlorethylen"}]
[58,{"$f":"IF(Definitioner!B59<>\"\",Definitioner!B59,\"\")","v":"Dichlormethan"}]
[59,{"$f":"IF(Definitioner!B60<>\"\",Definitioner!B60,\"\")","v":"1,1,2-trichlorethan"}]
[60,{"$f":"IF(Definitioner!B61<>\"\",Definitioner!B61,\"\")","v":"1,2-dichlorethan"}]
[61,{"$f":"IF(Definitioner!B62<>\"\",Definitioner!B62,\"\")","v":"1,2-dibromethan"}]
[62,{"$f":"IF(Definitioner!B63<>\"\",Definitioner!B63,\"\")","v":"Chlorbenzen"}]
[63,{"$f":"IF(Definitioner!B64<>\"\",Definitioner!B64,\"\")","v":"1,2-dichlorbenzen"}]
[64,{"$f":"IF(Definitioner!B65<>\"\",Definitioner!B65,\"\")","v":"1,4-dichlorbenzen"}]
[65,{"$f":"IF(Definitioner!B66<>\"\",Definitioner!B66,\"\")","v":"Chlorethan"}]
[66,{"$f":"IF(Definitioner!B67<>\"\",Definitioner!B67,\"\")","v":"TBA (tert-butyl-alkohol)"}]
[67,{"$f":"IF(Definitioner!B68<>\"\",Definitioner!B68,\"\")","v":"methanol"}]
[68,{"$f":"IF(Definitioner!B69<>\"\",Definitioner!B69,\"\")","v":"Ethanol"}]
[69,{"$f":"IF(Definitioner!B70<>\"\",Definitioner!B70,\"\")","v":"diethylether"}]
[70,{"$f":"IF(Definitioner!B71<>\"\",Definitioner!B71,\"\")","v":"acetone"}]
[71,{"$f":"IF(Definitioner!B72<>\"\",Definitioner!B72,\"\")","v":"isopropanol"}]
[72,{"$f":"IF(Definitioner!B73<>\"\",Definitioner!B73,\"\")","v":"1-propanol"}]
[73,{"$f":"IF(Definitioner!B74<>\"\",Definitioner!B74,\"\")","v":"diisopropylether"}]
[74,{"$f":"IF(Definitioner!B75<>\"\",Definitioner!B75,\"\")","v":"MEK"}]
[75,{"$f":"IF(Definitioner!B76<>\"\",Definitioner!B76,\"\")","v":"ethylacetat"}]
[76,{"$f":"IF(Definitioner!B77<>\"\",Definitioner!B77,\"\")","v":"methylacrylat"}]
[77,{"$f":"IF(Definitioner!B78<>\"\",Definitioner!B78,\"\")","v":"isobutanol"}]
[78,{"$f":"IF(Definitioner!B79<>\"\",Definitioner!B79,\"\")","v":"isopropylacetat"}]
[79,{"$f":"IF(Definitioner!B80<>\"\",Definitioner!B80,\"\")","v":"1-butanol"}]
[80,{"$f":"IF(Definitioner!B81<>\"\",Definitioner!B81,\"\")","v":"methylmetacrylat"}]
[81,{"$f":"IF(Definitioner!B82<>\"\",Definitioner!B82,\"\")","v":"MIBK"}]
[82,{"$f":"IF(Definitioner!B83<>\"\",Definitioner!B83,\"\")","v":"isobutylacetat"}]
[83,{"$f":"IF(Definitioner!B84<>\"\",Definitioner!B84,\"\")","v":"butylacetat"}]
[84,{"$f":"IF(Definitioner!B85<>\"\",Definitioner!B85,\"\")","v":"Vinylacetat"}]
[85,{"$f":"IF(Definitioner!B86<>\"\",Definitioner!B86,\"\")","v":"Acetaldehyd"}]
[86,{"$f":"IF(Definitioner!B87<>\"\",Definitioner!B87,\"\")","v":"Sum af xylener"}]
[87,{"$f":"IF(Definitioner!B88<>\"\",Definitioner!B88,\"\")","v":"Svovl, total"}]
[88,{"$f":"IF(Definitioner!B89<>\"\",Definitioner!B89,\"\")","v":"Chloroform"}]
[89,{"$f":"IF(Definitioner!B90<>\"\",Definitioner!B90,\"\")","v":"1,1,1-trichlorethan"}]
[90,{"$f":"IF(Definitioner!B91<>\"\",Definitioner!B91,\"\")","v":"Cyanid, total"}]
[91,{"$f":"IF(Definitioner!B92<>\"\",Definitioner!B92,\"\")","v":"Pentachlorphenol"}]
[92,{"$f":"IF(Definitioner!B93<>\"\",Definitioner!B93,\"\")","v":"Barium"}]
[93,{"$f":"IF(Definitioner!B94<>\"\",Definitioner!B94,\"\")","v":"PCB(total)*5"},0.1,50,50]
[94,{"$f":"IF(Definitioner!B95<>\"\",Definitioner!B95,\"\")","v":"Chlorparaffiner C10-C13"},10000,10000,10000]
[95,{"$f":"IF(Definitioner!B96<>\"\",Definitioner!B96,\"\")","v":"Chlorparaffiner C14-C17"},10000,10000,10000]
[96,{"$f":"IF(Definitioner!B97<>\"\",Definitioner!B97,\"\")","v":"Asbest"}]
[97,{"$f":"IF(Definitioner!B98<>\"\",Definitioner!B98,\"\")","v":"Aquatic Acute 1(H400)"}]
[98,{"$f":"IF(Definitioner!B99<>\"\",Definitioner!B99,\"\")","v":"Aquatic Chronic 1 (H410)"}]
[99,{"$f":"IF(Definitioner!B100<>\"\",Definitioner!B100,\"\")","v":"Tørstof"}]
[100,{"$f":"IF(Definitioner!B101<>\"\",Definitioner!B101,\"\")","v":"Phenol"}]
[101,{"$f":"IF(Definitioner!B102<>\"\",Definitioner!B102,\"\")","v":"Cresol (sum)"}]
[102,{"$f":"IF(Definitioner!B103<>\"\",Definitioner!B103,\"\")","v":"Xylenols"}]
[103,{"$f":"IF(Definitioner!B104<>\"\",Definitioner!B104,\"\")","v":"2-Methylphenol"}]
[104,{"$f":"IF(Definitioner!B105<>\"\",Definitioner!B105,\"\")","v":"3-Methylphenol"}]
[105,{"$f":"IF(Definitioner!B106<>\"\",Definitioner!B106,\"\")","v":"4-Methylphenol"}]
[106,{"$f":"IF(Definitioner!B107<>\"\",Definitioner!B107,\"\")","v":"2,3-Dimethylphenol"}]
[107,{"$f":"IF(Definitioner!B108<>\"\",Definitioner!B108,\"\")","v":"2,4-Dimethylphenol"}]
[108,{"$f":"IF(Definitioner!B109<>\"\",Definitioner!B109,\"\")","v":"2,5-Dimethylphenol"}]
[109,{"$f":"IF(Definitioner!B110<>\"\",Definitioner!B110,\"\")","v":"2,6-Dimethylphenol"}]
[110,{"$f":"IF(Definitioner!B111<>\"\",Definitioner!B111,\"\")","v":"3,4-Dimethylphenol"}]
[111,{"$f":"IF(Definitioner!B112<>\"\",Definitioner!B112,\"\")","v":"3,5-Dimethylphenol"}]
[112,{"$f":"IF(Definitioner!B113<>\"\",Definitioner!B113,\"\")","v":"Kobolt(Co)"}]
[113,{"$f":"IF(Definitioner!B114<>\"\",Definitioner!B114,\"\")","v":"Mangan(Mn)"}]
[114,{"$f":"IF(Definitioner!B115<>\"\",Definitioner!B115,\"\")","v":"Vanadium(V)"}]

{"sheet":"BYG1","index":9,"n_rows":117,"n_cols":5,"rows_kept":117,"cut":false,"hidden":true,"merged":[]}
["Bygningsmaterialer, Københavns kommune"]
[null,null,"<","<=",">"]
["Parameter ID","Parameter","Rent (Kat.1)","Forurenet (Kat.2)","Farligt affald (3)"]
[0,{"$f":"IF(Definitioner!B2<>\"\",Definitioner!B2,\"\")","v":"Dybde"}]
[1,{"$f":"IF(Definitioner!B3<>\"\",Definitioner!B3,\"\")","v":"Arsen"}]
[2,{"$f":"IF(Definitioner!B4<>\"\",Definitioner!B4,\"\")","v":"Bly "},40,2500,2500]
[3,{"$f":"IF(Definitioner!B5<>\"\",Definitioner!B5,\"\")","v":"Cadmium"},"0,50",1000,1000]
[4,{"$f":"IF(Definitioner!B6<>\"\",Definitioner!B6,\"\")","v":"Chrom VI"}]
[5,{"$f":"IF(Definitioner!B7<>\"\",Definitioner!B7,\"\")","v":"Chrom total"},500,1000,1000]
[6,{"$f":"IF(Definitioner!B8<>\"\",Definitioner!B8,\"\")","v":"Kobber "},500,2500,2500]
[7,{"$f":"IF(Definitioner!B9<>\"\",Definitioner!B9,\"\")","v":"Kviksølv"},"1,0",1000,1000]
[8,{"$f":"IF(Definitioner!B10<>\"\",Definitioner!B10,\"\")","v":"Nikkel"},30,1000,1000]
[9,{"$f":"IF(Definitioner!B11<>\"\",Definitioner!B11,\"\")","v":"Tin"}]
[10,{"$f":"IF(Definitioner!B12<>\"\",Definitioner!B12,\"\")","v":"Zink"},500,2500,2500]
[11,{"$f":"IF(Definitioner!B13<>\"\",Definitioner!B13,\"\")","v":"Sum C6-C35 (Reflab1)"}]
[12,{"$f":"IF(Definitioner!B14<>\"\",Definitioner!B14,\"\")","v":"C6-C10 (Reflab1)"}]
[13,{"$f":"IF(Definitioner!B15<>\"\",Definitioner!B15,\"\")","v":"C10-C25 (Reflab1 gl.)"}]
[14,{"$f":"IF(Definitioner!B16<>\"\",Definitioner!B16,\"\")","v":"C25-C35 (Reflab1 gl.)"}]
[15,{"$f":"IF(Definitioner!B17<>\"\",Definitioner!B17,\"\")","v":"BTEX, sum"}]
[16,{"$f":"IF(Definitioner!B18<>\"\",Definitioner!B18,\"\")","v":"Benzen"}]
[17,{"$f":"IF(Definitioner!B19<>\"\",Definitioner!B19,\"\")","v":"Naphtalen"}]
[18,{"$f":"IF(Definitioner!B20<>\"\",Definitioner!B20,\"\")","v":"Sum af 7 PAH'er"},"4,0",1000,1000]
[19,{"$f":"IF(Definitioner!B21<>\"\",Definitioner!B21,\"\")","v":"Benz(a)pyren"}]
[20,{"$f":"IF(Definitioner!B22<>\"\",Definitioner!B22,\"\")","v":"Dibenz(a,h)anthracen"}]
[21,{"$f":"IF(Definitioner!B23<>\"\",Definitioner!B23,\"\")","v":"Phenoler, sum"}]
[22,{"$f":"IF(Definitioner!B24<>\"\",Definitioner!B24,\"\")","v":"Cyanid, total"}]
[23,{"$f":"IF(Definitioner!B25<>\"\",Definitioner!B25,\"\")","v":"Cyanid, syreflygtig"}]
[24,{"$f":"IF(Definitioner!B26<>\"\",Definitioner!B26,\"\")","v":"Fluoranthen"}]
[25,{"$f":"IF(Definitioner!B27<>\"\",Definitioner!B27,\"\")","v":"Benz(b+j+k)fluoranthen"}]
[26,{"$f":"IF(Definitioner!B28<>\"\",Definitioner!B28,\"\")","v":"Indeno(1,2,3-cd)pyren"}]
[27,{"$f":"IF(Definitioner!B29<>\"\",Definitioner!B29,\"\")","v":"Chrom (bortset fra VI)"}]
[28,{"$f":"IF(Definitioner!B30<>\"\",Definitioner!B30,\"\")","v":"Sum C6-C40 (Reflab4)"}]
[29,{"$f":"IF(Definitioner!B31<>\"\",Definitioner!B31,\"\")","v":"C6-C10 (Reflab4)"}]
[30,{"$f":"IF(Definitioner!B32<>\"\",Definitioner!B32,\"\")","v":"C10-C20 (Reflab4)"}]
[31,{"$f":"IF(Definitioner!B33<>\"\",Definitioner!B33,\"\")","v":"C10-C15 (Reflab4)"}]
[32,{"$f":"IF(Definitioner!B34<>\"\",Definitioner!B34,\"\")","v":"C15-C20 (Reflab4)"}]
[33,{"$f":"IF(Definitioner!B35<>\"\",Definitioner!B35,\"\")","v":"C20-C40 (Reflab4)"}]
[34,{"$f":"IF(Definitioner!B36<>\"\",Definitioner!B36,\"\")","v":"Terpentin (C7-C12) (Reflab1)"}]
[35,{"$f":"IF(Definitioner!B37<>\"\",Definitioner!B37,\"\")","v":"Petroleum (C9-C16) (Reflab1)"}]
[36,{"$f":"IF(Definitioner!B38<>\"\",Definitioner!B38,\"\")","v":"Terpentin (C7-C12) (Reflab4)"}]
[37,{"$f":"IF(Definitioner!B39<>\"\",Definitioner!B39,\"\")","v":"Petroleum (C9-C16) (Reflab4)"}]
[39,{"$f":"IF(Definitioner!B40<>\"\",Definitioner!B40,\"\")","v":"Molybdæn"}]
[40,{"$f":"IF(Definitioner!B41<>\"\",Definitioner!B41,\"\")","v":"MTBE"}]
[41,{"$f":"IF(Definitioner!B42<>\"\",Definitioner!B42,\"\")","v":"Trichlorethylen"}]
[42,{"$f":"IF(Definitioner!B43<>\"\",Definitioner!B43,\"\")","v":"Tetrachlorethylen"}]
[43,{"$f":"IF(Definitioner!B44<>\"\",Definitioner!B44,\"\")","v":"Tetrachlormethan"}]
[44,{"$f":"IF(Definitioner!B45<>\"\",Definitioner!B45,\"\")","v":"Toluen"}]
[45,{"$f":"IF(Definitioner!B46<>\"\",Definitioner!B46,\"\")","v":"Ethylbenzen"}]
[46,{"$f":"IF(Definitioner!B47<>\"\",Definitioner!B47,\"\")","v":"o-Xylen"}]
[47,{"$f":"IF(Definitioner!B48<>\"\",Definitioner!B48,\"\")","v":"m+p-Xylen"}]
[48,{"$f":"IF(Definitioner!B49<>\"\",Definitioner!B49,\"\")","v":"C20-C35 (Reflab1)"}]
[49,{"$f":"IF(Definitioner!B50<>\"\",Definitioner!B50,\"\")","v":"C15-C20 (Reflab1)"}]
[50,{"$f":"IF(Definitioner!B51<>\"\",Definitioner!B51,\"\")","v":"C10-C15 (Reflab1)"}]
[51,{"$f":"IF(Definitioner!B52<>\"\",Definitioner!B52,\"\")","v":"Sum C10-C20 (Reflab4)"}]
[52,{"$f":"IF(Definitioner!B53<>\"\",Definitioner!B53,\"\")","v":"Sum C10-C20 (Reflab1)"}]
[53,{"$f":"IF(Definitioner!B54<>\"\",Definitioner!B54,\"\")","v":"Vinylchlorid"}]
[54,{"$f":"IF(Definitioner!B55<>\"\",Definitioner!B55,\"\")","v":"1,1-dichlorethylen"}]
[55,{"$f":"IF(Definitioner!B56<>\"\",Definitioner!B56,\"\")","v":"trans-1,2-dichlorethylen"}]
[56,{"$f":"IF(Definitioner!B57<>\"\",Definitioner!B57,\"\")","v":"1,1-dichlorethan"}]
[57,{"$f":"IF(Definitioner!B58<>\"\",Definitioner!B58,\"\")","v":"cis-1,2-dichlorethylen"}]
[58,{"$f":"IF(Definitioner!B59<>\"\",Definitioner!B59,\"\")","v":"Dichlormethan"}]
[59,{"$f":"IF(Definitioner!B60<>\"\",Definitioner!B60,\"\")","v":"1,1,2-trichlorethan"}]
[60,{"$f":"IF(Definitioner!B61<>\"\",Definitioner!B61,\"\")","v":"1,2-dichlorethan"}]
[61,{"$f":"IF(Definitioner!B62<>\"\",Definitioner!B62,\"\")","v":"1,2-dibromethan"}]
[62,{"$f":"IF(Definitioner!B63<>\"\",Definitioner!B63,\"\")","v":"Chlorbenzen"}]
[63,{"$f":"IF(Definitioner!B64<>\"\",Definitioner!B64,\"\")","v":"1,2-dichlorbenzen"}]
[64,{"$f":"IF(Definitioner!B65<>\"\",Definitioner!B65,\"\")","v":"1,4-dichlorbenzen"}]
[65,{"$f":"IF(Definitioner!B66<>\"\",Definitioner!B66,\"\")","v":"Chlorethan"}]
[66,{"$f":"IF(Definitioner!B67<>\"\",Definitioner!B67,\"\")","v":"TBA (tert-butyl-alkohol)"}]
[67,{"$f":"IF(Definitioner!B68<>\"\",Definitioner!B68,\"\")","v":"methanol"}]
[68,{"$f":"IF(Definitioner!B69<>\"\",Definitioner!B69,\"\")","v":"Ethanol"}]
[69,{"$f":"IF(Definitioner!B70<>\"\",Definitioner!B70,\"\")","v":"diethylether"}]
[70,{"$f":"IF(Definitioner!B71<>\"\",Definitioner!B71,\"\")","v":"acetone"}]
[71,{"$f":"IF(Definitioner!B72<>\"\",Definitioner!B72,\"\")","v":"isopropanol"}]
[72,{"$f":"IF(Definitioner!B73<>\"\",Definitioner!B73,\"\")","v":"1-propanol"}]
[73,{"$f":"IF(Definitioner!B74<>\"\",Definitioner!B74,\"\")","v":"diisopropylether"}]
[74,{"$f":"IF(Definitioner!B75<>\"\",Definitioner!B75,\"\")","v":"MEK"}]
[75,{"$f":"IF(Definitioner!B76<>\"\",Definitioner!B76,\"\")","v":"ethylacetat"}]
[76,{"$f":"IF(Definitioner!B77<>\"\",Definitioner!B77,\"\")","v":"methylacrylat"}]
[77,{"$f":"IF(Definitioner!B78<>\"\",Definitioner!B78,\"\")","v":"isobutanol"}]
[78,{"$f":"IF(Definitioner!B79<>\"\",Definitioner!B79,\"\")","v":"isopropylacetat"}]
[79,{"$f":"IF(Definitioner!B80<>\"\",Definitioner!B80,\"\")","v":"1-butanol"}]
[80,{"$f":"IF(Definitioner!B81<>\"\",Definitioner!B81,\"\")","v":"methylmetacrylat"}]
[81,{"$f":"IF(Definitioner!B82<>\"\",Definitioner!B82,\"\")","v":"MIBK"}]
[82,{"$f":"IF(Definitioner!B83<>\"\",Definitioner!B83,\"\")","v":"isobutylacetat"}]
[83,{"$f":"IF(Definitioner!B84<>\"\",Definitioner!B84,\"\")","v":"butylacetat"}]
[84,{"$f":"IF(Definitioner!B85<>\"\",Definitioner!B85,\"\")","v":"Vinylacetat"}]
[85,{"$f":"IF(Definitioner!B86<>\"\",Definitioner!B86,\"\")","v":"Acetaldehyd"}]
[86,{"$f":"IF(Definitioner!B87<>\"\",Definitioner!B87,\"\")","v":"Sum af xylener"}]
[87,{"$f":"IF(Definitioner!B88<>\"\",Definitioner!B88,\"\")","v":"Svovl, total"}]
[88,{"$f":"IF(Definitioner!B89<>\"\",Definitioner!B89,\"\")","v":"Chloroform"}]
[89,{"$f":"IF(Definitioner!B90<>\"\",Definitioner!B90,\"\")","v":"1,1,1-trichlorethan"}]
[90,{"$f":"IF(Definitioner!B91<>\"\",Definitioner!B91,\"\")","v":"Cyanid, total"}]
[91,{"$f":"IF(Definitioner!B92<>\"\",Definitioner!B92,\"\")","v":"Pentachlorphenol"}]
[92,{"$f":"IF(Definitioner!B93<>\"\",Definitioner!B93,\"\")","v":"Barium"}]
[93,{"$f":"IF(Definitioner!B94<>\"\",Definitioner!B94,\"\")","v":"PCB(total)*5"},"0,10",50,50]
[94,{"$f":"IF(Definitioner!B95<>\"\",Definitioner!B95,\"\")","v":"Chlorparaffiner C10-C13"},"1,0","1,0","1,0"]
[95,{"$f":"IF(Definitioner!B96<>\"\",Definitioner!B96,\"\")","v":"Chlorparaffiner C14-C17"},"1,0","1,0","1,0"]
[96,{"$f":"IF(Definitioner!B97<>\"\",Definitioner!B97,\"\")","v":"Asbest"},"Ikke påvist",null,"påvist"]
[97,{"$f":"IF(Definitioner!B98<>\"\",Definitioner!B98,\"\")","v":"Aquatic Acute 1(H400)"}]
[98,{"$f":"IF(Definitioner!B99<>\"\",Definitioner!B99,\"\")","v":"Aquatic Chronic 1 (H410)"}]
[99,{"$f":"IF(Definitioner!B100<>\"\",Definitioner!B100,\"\")","v":"Tørstof"}]
[100,{"$f":"IF(Definitioner!B101<>\"\",Definitioner!B101,\"\")","v":"Phenol"}]
[101,{"$f":"IF(Definitioner!B102<>\"\",Definitioner!B102,\"\")","v":"Cresol (sum)"}]
[102,{"$f":"IF(Definitioner!B103<>\"\",Definitioner!B103,\"\")","v":"Xylenols"}]
[103,{"$f":"IF(Definitioner!B104<>\"\",Definitioner!B104,\"\")","v":"2-Methylphenol"}]
[104,{"$f":"IF(Definitioner!B105<>\"\",Definitioner!B105,\"\")","v":"3-Methylphenol"}]
[105,{"$f":"IF(Definitioner!B106<>\"\",Definitioner!B106,\"\")","v":"4-Methylphenol"}]
[106,{"$f":"IF(Definitioner!B107<>\"\",Definitioner!B107,\"\")","v":"2,3-Dimethylphenol"}]
[107,{"$f":"IF(Definitioner!B108<>\"\",Definitioner!B108,\"\")","v":"2,4-Dimethylphenol"}]
[108,{"$f":"IF(Definitioner!B109<>\"\",Definitioner!B109,\"\")","v":"2,5-Dimethylphenol"}]
[109,{"$f":"IF(Definitioner!B110<>\"\",Definitioner!B110,\"\")","v":"2,6-Dimethylphenol"}]
[110,{"$f":"IF(Definitioner!B111<>\"\",Definitioner!B111,\"\")","v":"3,4-Dimethylphenol"}]
[111,{"$f":"IF(Definitioner!B112<>\"\",Definitioner!B112,\"\")","v":"3,5-Dimethylphenol"}]
[112,{"$f":"IF(Definitioner!B113<>\"\",Definitioner!B113,\"\")","v":"Kobolt(Co)"}]
[113,{"$f":"IF(Definitioner!B114<>\"\",Definitioner!B114,\"\")","v":"Mangan(Mn)"}]
[114,{"$f":"IF(Definitioner!B115<>\"\",Definitioner!B115,\"\")","v":"Vanadium(V)"}]

{"sheet":"Udgået_miljø","index":10,"n_rows":102,"n_cols":5,"rows_kept":102,"cut":false,"hidden":true,"merged":[]}
["Miljøministeriets vejledning 2010"]
[null,null,"<=",">",">"]
["Parameter ID","Parameter","Overholdt","Jordkvalitets kriteriet","Afskærings kriteriet"]
[0,{"$f":"IF(Definitioner!B2<>\"\",Definitioner!B2,\"\")","v":"Dybde"}]
[1,{"$f":"IF(Definitioner!B3<>\"\",Definitioner!B3,\"\")","v":"Arsen"},20,20,20]
[2,{"$f":"IF(Definitioner!B4<>\"\",Definitioner!B4,\"\")","v":"Bly "},40,40,400]
[3,{"$f":"IF(Definitioner!B5<>\"\",Definitioner!B5,\"\")","v":"Cadmium"},0.5,0.5,5]
[4,{"$f":"IF(Definitioner!B6<>\"\",Definitioner!B6,\"\")","v":"Chrom VI"},20,20,20]
[5,{"$f":"IF(Definitioner!B7<>\"\",Definitioner!B7,\"\")","v":"Chrom total"},500,500,1000]
[6,{"$f":"IF(Definitioner!B8<>\"\",Definitioner!B8,\"\")","v":"Kobber "},500,500,1000]
[7,{"$f":"IF(Definitioner!B9<>\"\",Definitioner!B9,\"\")","v":"Kviksølv"},1,1,3]
[8,{"$f":"IF(Definitioner!B10<>\"\",Definitioner!B10,\"\")","v":"Nikkel"},30,30,30]
[9,{"$f":"IF(Definitioner!B11<>\"\",Definitioner!B11,\"\")","v":"Tin"}]
[10,{"$f":"IF(Definitioner!B12<>\"\",Definitioner!B12,\"\")","v":"Zink"},500,500,1000]
[11,{"$f":"IF(Definitioner!B13<>\"\",Definitioner!B13,\"\")","v":"Sum C6-C35 (Reflab1)"},100,100,300]
[12,{"$f":"IF(Definitioner!B14<>\"\",Definitioner!B14,\"\")","v":"C6-C10 (Reflab1)"},25,25]
[13,{"$f":"IF(Definitioner!B15<>\"\",Definitioner!B15,\"\")","v":"C10-C25 (Reflab1 gl.)"}]
[14,{"$f":"IF(Definitioner!B16<>\"\",Definitioner!B16,\"\")","v":"C25-C35 (Reflab1 gl.)"}]
[15,{"$f":"IF(Definitioner!B17<>\"\",Definitioner!B17,\"\")","v":"BTEX, sum"}]
[16,{"$f":"IF(Definitioner!B18<>\"\",Definitioner!B18,\"\")","v":"Benzen"},1.5,1.5]
[17,{"$f":"IF(Definitioner!B19<>\"\",Definitioner!B19,\"\")","v":"Naphtalen"}]
[18,{"$f":"IF(Definitioner!B20<>\"\",Definitioner!B20,\"\")","v":"Sum af 7 PAH'er"},4,4,40]
[19,{"$f":"IF(Definitioner!B21<>\"\",Definitioner!B21,\"\")","v":"Benz(a)pyren"},0.3,0.3,3]
[20,{"$f":"IF(Definitioner!B22<>\"\",Definitioner!B22,\"\")","v":"Dibenz(a,h)anthracen"},0.3,0.3,3]
[21,{"$f":"IF(Definitioner!B23<>\"\",Definitioner!B23,\"\")","v":"Phenoler, sum"}]
[22,{"$f":"IF(Definitioner!B24<>\"\",Definitioner!B24,\"\")","v":"Cyanid, total"},500000,500000]
[23,{"$f":"IF(Definitioner!B25<>\"\",Definitioner!B25,\"\")","v":"Cyanid, syreflygtig"},10000,10000]
[24,{"$f":"IF(Definitioner!B26<>\"\",Definitioner!B26,\"\")","v":"Fluoranthen"}]
[25,{"$f":"IF(Definitioner!B27<>\"\",Definitioner!B27,\"\")","v":"Benz(b+j+k)fluoranthen"}]
[26,{"$f":"IF(Definitioner!B28<>\"\",Definitioner!B28,\"\")","v":"Indeno(1,2,3-cd)pyren"}]
[27,{"$f":"IF(Definitioner!B29<>\"\",Definitioner!B29,\"\")","v":"Chrom (bortset fra VI)"}]
[28,{"$f":"IF(Definitioner!B30<>\"\",Definitioner!B30,\"\")","v":"Sum C6-C40 (Reflab4)"}]
[29,{"$f":"IF(Definitioner!B31<>\"\",Definitioner!B31,\"\")","v":"C6-C10 (Reflab4)"}]
[30,{"$f":"IF(Definitioner!B32<>\"\",Definitioner!B32,\"\")","v":"C10-C20 (Reflab4)"}]
[31,{"$f":"IF(Definitioner!B33<>\"\",Definitioner!B33,\"\")","v":"C10-C15 (Reflab4)"}]
[32,{"$f":"IF(Definitioner!B34<>\"\",Definitioner!B34,\"\")","v":"C15-C20 (Reflab4)"}]
[33,{"$f":"IF(Definitioner!B35<>\"\",Definitioner!B35,\"\")","v":"C20-C40 (Reflab4)"}]
[34,{"$f":"IF(Definitioner!B36<>\"\",Definitioner!B36,\"\")","v":"Terpentin (C7-C12) (Reflab1)"}]
[35,{"$f":"IF(Definitioner!B37<>\"\",Definitioner!B37,\"\")","v":"Petroleum (C9-C16) (Reflab1)"}]
[36,{"$f":"IF(Definitioner!B38<>\"\",Definitioner!B38,\"\")","v":"Terpentin (C7-C12) (Reflab4)"}]
[37,{"$f":"IF(Definitioner!B39<>\"\",Definitioner!B39,\"\")","v":"Petroleum (C9-C16) (Reflab4)"}]
[39,{"$f":"IF(Definitioner!B40<>\"\",Definitioner!B40,\"\")","v":"Molybdæn"}]
[40,{"$f":"IF(Definitioner!B41<>\"\",Definitioner!B41,\"\")","v":"MTBE"}]
[41,{"$f":"IF(Definitioner!B42<>\"\",Definitioner!B42,\"\")","v":"Trichlorethylen"}]
[42,{"$f":"IF(Definitioner!B43<>\"\",Definitioner!B43,\"\")","v":"Tetrachlorethylen"}]
[43,{"$f":"IF(Definitioner!B44<>\"\",Definitioner!B44,\"\")","v":"Tetrachlormethan"}]
[44,{"$f":"IF(Definitioner!B45<>\"\",Definitioner!B45,\"\")","v":"Toluen"}]
[45,{"$f":"IF(Definitioner!B46<>\"\",Definitioner!B46,\"\")","v":"Ethylbenzen"}]
[46,{"$f":"IF(Definitioner!B47<>\"\",Definitioner!B47,\"\")","v":"o-Xylen"}]
[47,{"$f":"IF(Definitioner!B48<>\"\",Definitioner!B48,\"\")","v":"m+p-Xylen"}]
[48,{"$f":"IF(Definitioner!B49<>\"\",Definitioner!B49,\"\")","v":"C20-C35 (Reflab1)"},100,100,300]
[49,{"$f":"IF(Definitioner!B50<>\"\",Definitioner!B50,\"\")","v":"C15-C20 (Reflab1)"},55,55]
[50,{"$f":"IF(Definitioner!B51<>\"\",Definitioner!B51,\"\")","v":"C10-C15 (Reflab1)"},40,40]
[51,{"$f":"IF(Definitioner!B52<>\"\",Definitioner!B52,\"\")","v":"Sum C10-C20 (Reflab4)"}]
[52,{"$f":"IF(Definitioner!B53<>\"\",Definitioner!B53,\"\")","v":"Sum C10-C20 (Reflab1)"}]
[53,{"$f":"IF(Definitioner!B54<>\"\",Definitioner!B54,\"\")","v":"Vinylchlorid"}]
[54,{"$f":"IF(Definitioner!B55<>\"\",Definitioner!B55,\"\")","v":"1,1-dichlorethylen"}]
[55,{"$f":"IF(Definitioner!B56<>\"\",Definitioner!B56,\"\")","v":"trans-1,2-dichlorethylen"}]
[56,{"$f":"IF(Definitioner!B57<>\"\",Definitioner!B57,\"\")","v":"1,1-dichlorethan"}]
[57,{"$f":"IF(Definitioner!B58<>\"\",Definitioner!B58,\"\")","v":"cis-1,2-dichlorethylen"}]
[58,{"$f":"IF(Definitioner!B59<>\"\",Definitioner!B59,\"\")","v":"Dichlormethan"}]
[59,{"$f":"IF(Definitioner!B60<>\"\",Definitioner!B60,\"\")","v":"1,1,2-trichlorethan"}]
[60,{"$f":"IF(Definitioner!B61<>\"\",Definitioner!B61,\"\")","v":"1,2-dichlorethan"}]
[61,{"$f":"IF(Definitioner!B62<>\"\",Definitioner!B62,\"\")","v":"1,2-dibromethan"}]
[62,{"$f":"IF(Definitioner!B63<>\"\",Definitioner!B63,\"\")","v":"Chlorbenzen"}]
[63,{"$f":"IF(Definitioner!B64<>\"\",Definitioner!B64,\"\")","v":"1,2-dichlorbenzen"}]
[64,{"$f":"IF(Definitioner!B65<>\"\",Definitioner!B65,\"\")","v":"1,4-dichlorbenzen"}]
[65,{"$f":"IF(Definitioner!B66<>\"\",Definitioner!B66,\"\")","v":"Chlorethan"}]
[66,{"$f":"IF(Definitioner!B67<>\"\",Definitioner!B67,\"\")","v":"TBA (tert-butyl-alkohol)"}]
[67,{"$f":"IF(Definitioner!B68<>\"\",Definitioner!B68,\"\")","v":"methanol"}]
[68,{"$f":"IF(Definitioner!B69<>\"\",Definitioner!B69,\"\")","v":"Ethanol"}]
[69,{"$f":"IF(Definitioner!B70<>\"\",Definitioner!B70,\"\")","v":"diethylether"}]
[70,{"$f":"IF(Definitioner!B71<>\"\",Definitioner!B71,\"\")","v":"acetone"}]
[71,{"$f":"IF(Definitioner!B72<>\"\",Definitioner!B72,\"\")","v":"isopropanol"}]
[72,{"$f":"IF(Definitioner!B73<>\"\",Definitioner!B73,\"\")","v":"1-propanol"}]
[73,{"$f":"IF(Definitioner!B74<>\"\",Definitioner!B74,\"\")","v":"diisopropylether"}]
[74,{"$f":"IF(Definitioner!B75<>\"\",Definitioner!B75,\"\")","v":"MEK"}]
[75,{"$f":"IF(Definitioner!B76<>\"\",Definitioner!B76,\"\")","v":"ethylacetat"}]
[76,{"$f":"IF(Definitioner!B77<>\"\",Definitioner!B77,\"\")","v":"methylacrylat"}]
[77,{"$f":"IF(Definitioner!B78<>\"\",Definitioner!B78,\"\")","v":"isobutanol"}]
[78,{"$f":"IF(Definitioner!B79<>\"\",Definitioner!B79,\"\")","v":"isopropylacetat"}]
[79,{"$f":"IF(Definitioner!B80<>\"\",Definitioner!B80,\"\")","v":"1-butanol"}]
[80,{"$f":"IF(Definitioner!B81<>\"\",Definitioner!B81,\"\")","v":"methylmetacrylat"}]
[81,{"$f":"IF(Definitioner!B82<>\"\",Definitioner!B82,\"\")","v":"MIBK"}]
[82,{"$f":"IF(Definitioner!B83<>\"\",Definitioner!B83,\"\")","v":"isobutylacetat"}]
[83,{"$f":"IF(Definitioner!B84<>\"\",Definitioner!B84,\"\")","v":"butylacetat"}]
[84,{"$f":"IF(Definitioner!B85<>\"\",Definitioner!B85,\"\")","v":"Vinylacetat"}]
[85,{"$f":"IF(Definitioner!B86<>\"\",Definitioner!B86,\"\")","v":"Acetaldehyd"}]
[86,{"$f":"IF(Definitioner!B87<>\"\",Definitioner!B87,\"\")","v":"Sum af xylener"}]
[87,{"$f":"IF(Definitioner!B88<>\"\",Definitioner!B88,\"\")","v":"Svovl, total"}]
[88,{"$f":"IF(Definitioner!B89<>\"\",Definitioner!B89,\"\")","v":"Chloroform"}]
[89,{"$f":"IF(Definitioner!B90<>\"\",Definitioner!B90,\"\")","v":"1,1,1-trichlorethan"}]
[90,{"$f":"IF(Definitioner!B91<>\"\",Definitioner!B91,\"\")","v":"Cyanid, total"}]
[91,{"$f":"IF(Definitioner!B92<>\"\",Definitioner!B92,\"\")","v":"Pentachlorphenol"}]
[92,{"$f":"IF(Definitioner!B93<>\"\",Definitioner!B93,\"\")","v":"Barium"}]
[93,{"$f":"IF(Definitioner!B94<>\"\",Definitioner!B94,\"\")","v":"PCB(total)*5"}]
[94,{"$f":"IF(Definitioner!B95<>\"\",Definitioner!B95,\"\")","v":"Chlorparaffiner C10-C13"}]
[95,{"$f":"IF(Definitioner!B96<>\"\",Definitioner!B96,\"\")","v":"Chlorparaffiner C14-C17"}]
[96,{"$f":"IF(Definitioner!B97<>\"\",Definitioner!B97,\"\")","v":"Asbest"}]
[97,{"$f":"IF(Definitioner!B98<>\"\",Definitioner!B98,\"\")","v":"Aquatic Acute 1(H400)"}]
[98,{"$f":"IF(Definitioner!B99<>\"\",Definitioner!B99,\"\")","v":"Aquatic Chronic 1 (H410)"}]
[99,{"$f":"IF(Definitioner!B100<>\"\",Definitioner!B100,\"\")","v":"Tørstof"}]

{"sheet":"Udgået_århus","index":11,"n_rows":102,"n_cols":5,"rows_kept":102,"cut":false,"hidden":true,"merged":[]}
["Aarhus Kommune"]
[null,null,"<=","<=",">"]
["Parameter ID","Parameter","Ren jord","Let forurenet","Kraftigere forurenet"]
[0,{"$f":"IF(Definitioner!B2<>\"\",Definitioner!B2,\"\")","v":"Dybde"}]
[1,{"$f":"IF(Definitioner!B3<>\"\",Definitioner!B3,\"\")","v":"Arsen"},20,20,20]
[2,{"$f":"IF(Definitioner!B4<>\"\",Definitioner!B4,\"\")","v":"Bly "},40,400,400]
[3,{"$f":"IF(Definitioner!B5<>\"\",Definitioner!B5,\"\")","v":"Cadmium"},0.5,5,5]
[4,{"$f":"IF(Definitioner!B6<>\"\",Definitioner!B6,\"\")","v":"Chrom VI"},20,20,20]
[5,{"$f":"IF(Definitioner!B7<>\"\",Definitioner!B7,\"\")","v":"Chrom total"},500,1000,1000]
[6,{"$f":"IF(Definitioner!B8<>\"\",Definitioner!B8,\"\")","v":"Kobber "},500,1000,1000]
[7,{"$f":"IF(Definitioner!B9<>\"\",Definitioner!B9,\"\")","v":"Kviksølv"},1,3,3]
[8,{"$f":"IF(Definitioner!B10<>\"\",Definitioner!B10,\"\")","v":"Nikkel"},30,30,30]
[9,{"$f":"IF(Definitioner!B11<>\"\",Definitioner!B11,\"\")","v":"Tin"}]
[10,{"$f":"IF(Definitioner!B12<>\"\",Definitioner!B12,\"\")","v":"Zink"},500,1000,1000]
[11,{"$f":"IF(Definitioner!B13<>\"\",Definitioner!B13,\"\")","v":"Sum C6-C35 (Reflab1)"},100,500,500]
[12,{"$f":"IF(Definitioner!B14<>\"\",Definitioner!B14,\"\")","v":"C6-C10 (Reflab1)"},25,50,50]
[13,{"$f":"IF(Definitioner!B15<>\"\",Definitioner!B15,\"\")","v":"C10-C25 (Reflab1 gl.)"},100,200,200]
[14,{"$f":"IF(Definitioner!B16<>\"\",Definitioner!B16,\"\")","v":"C25-C35 (Reflab1 gl.)"},100,300,300]
[15,{"$f":"IF(Definitioner!B17<>\"\",Definitioner!B17,\"\")","v":"BTEX, sum"}]
[16,{"$f":"IF(Definitioner!B18<>\"\",Definitioner!B18,\"\")","v":"Benzen"},1.5,5,5]
[17,{"$f":"IF(Definitioner!B19<>\"\",Definitioner!B19,\"\")","v":"Naphtalen"},1,5,5]
[18,{"$f":"IF(Definitioner!B20<>\"\",Definitioner!B20,\"\")","v":"Sum af 7 PAH'er"},4,40,40]
[19,{"$f":"IF(Definitioner!B21<>\"\",Definitioner!B21,\"\")","v":"Benz(a)pyren"},0.3,3,3]
[20,{"$f":"IF(Definitioner!B22<>\"\",Definitioner!B22,\"\")","v":"Dibenz(a,h)anthracen"},0.3,3,3]
[21,{"$f":"IF(Definitioner!B23<>\"\",Definitioner!B23,\"\")","v":"Phenoler, sum"}]
[22,{"$f":"IF(Definitioner!B24<>\"\",Definitioner!B24,\"\")","v":"Cyanid, total"},null,1000,1000]
[23,{"$f":"IF(Definitioner!B25<>\"\",Definitioner!B25,\"\")","v":"Cyanid, syreflygtig"},null,100,100]
[24,{"$f":"IF(Definitioner!B26<>\"\",Definitioner!B26,\"\")","v":"Fluoranthen"}]
[25,{"$f":"IF(Definitioner!B27<>\"\",Definitioner!B27,\"\")","v":"Benz(b+j+k)fluoranthen"}]
[26,{"$f":"IF(Definitioner!B28<>\"\",Definitioner!B28,\"\")","v":"Indeno(1,2,3-cd)pyren"}]
[27,{"$f":"IF(Definitioner!B29<>\"\",Definitioner!B29,\"\")","v":"Chrom (bortset fra VI)"}]
[28,{"$f":"IF(Definitioner!B30<>\"\",Definitioner!B30,\"\")","v":"Sum C6-C40 (Reflab4)"},150,450,450]
[29,{"$f":"IF(Definitioner!B31<>\"\",Definitioner!B31,\"\")","v":"C6-C10 (Reflab4)"},25,50,50]
[30,{"$f":"IF(Definitioner!B32<>\"\",Definitioner!B32,\"\")","v":"C10-C20 (Reflab4)"}]
[31,{"$f":"IF(Definitioner!B33<>\"\",Definitioner!B33,\"\")","v":"C10-C15 (Reflab4)"},40,80,80]
[32,{"$f":"IF(Definitioner!B34<>\"\",Definitioner!B34,\"\")","v":"C15-C20 (Reflab4)"},55,110,110]
[33,{"$f":"IF(Definitioner!B35<>\"\",Definitioner!B35,\"\")","v":"C20-C40 (Reflab4)"},150,450,450]
[34,{"$f":"IF(Definitioner!B36<>\"\",Definitioner!B36,\"\")","v":"Terpentin (C7-C12) (Reflab1)"},25,50,50]
[35,{"$f":"IF(Definitioner!B37<>\"\",Definitioner!B37,\"\")","v":"Petroleum (C9-C16) (Reflab1)"},25,50,50]
[36,{"$f":"IF(Definitioner!B38<>\"\",Definitioner!B38,\"\")","v":"Terpentin (C7-C12) (Reflab4)"}]
[37,{"$f":"IF(Definitioner!B39<>\"\",Definitioner!B39,\"\")","v":"Petroleum (C9-C16) (Reflab4)"}]
[39,{"$f":"IF(Definitioner!B40<>\"\",Definitioner!B40,\"\")","v":"Molybdæn"},5,25,25]
[40,{"$f":"IF(Definitioner!B41<>\"\",Definitioner!B41,\"\")","v":"MTBE"},0.01,1,1]
[41,{"$f":"IF(Definitioner!B42<>\"\",Definitioner!B42,\"\")","v":"Trichlorethylen"},5,10,10]
[42,{"$f":"IF(Definitioner!B43<>\"\",Definitioner!B43,\"\")","v":"Tetrachlorethylen"},5,10,10]
[43,{"$f":"IF(Definitioner!B44<>\"\",Definitioner!B44,\"\")","v":"Tetrachlormethan"},5,10,10]
[44,{"$f":"IF(Definitioner!B45<>\"\",Definitioner!B45,\"\")","v":"Toluen"}]
[45,{"$f":"IF(Definitioner!B46<>\"\",Definitioner!B46,\"\")","v":"Ethylbenzen"}]
[46,{"$f":"IF(Definitioner!B47<>\"\",Definitioner!B47,\"\")","v":"o-Xylen"}]
[47,{"$f":"IF(Definitioner!B48<>\"\",Definitioner!B48,\"\")","v":"m+p-Xylen"}]
[48,{"$f":"IF(Definitioner!B49<>\"\",Definitioner!B49,\"\")","v":"C20-C35 (Reflab1)"},100,300,300]
[49,{"$f":"IF(Definitioner!B50<>\"\",Definitioner!B50,\"\")","v":"C15-C20 (Reflab1)"},55,55]
[50,{"$f":"IF(Definitioner!B51<>\"\",Definitioner!B51,\"\")","v":"C10-C15 (Reflab1)"},40,40]
[51,{"$f":"IF(Definitioner!B52<>\"\",Definitioner!B52,\"\")","v":"Sum C10-C20 (Reflab4)"}]
[52,{"$f":"IF(Definitioner!B53<>\"\",Definitioner!B53,\"\")","v":"Sum C10-C20 (Reflab1)"}]
[53,{"$f":"IF(Definitioner!B54<>\"\",Definitioner!B54,\"\")","v":"Vinylchlorid"}]
[54,{"$f":"IF(Definitioner!B55<>\"\",Definitioner!B55,\"\")","v":"1,1-dichlorethylen"}]
[55,{"$f":"IF(Definitioner!B56<>\"\",Definitioner!B56,\"\")","v":"trans-1,2-dichlorethylen"}]
[56,{"$f":"IF(Definitioner!B57<>\"\",Definitioner!B57,\"\")","v":"1,1-dichlorethan"}]
[57,{"$f":"IF(Definitioner!B58<>\"\",Definitioner!B58,\"\")","v":"cis-1,2-dichlorethylen"}]
[58,{"$f":"IF(Definitioner!B59<>\"\",Definitioner!B59,\"\")","v":"Dichlormethan"}]
[59,{"$f":"IF(Definitioner!B60<>\"\",Definitioner!B60,\"\")","v":"1,1,2-trichlorethan"}]
[60,{"$f":"IF(Definitioner!B61<>\"\",Definitioner!B61,\"\")","v":"1,2-dichlorethan"}]
[61,{"$f":"IF(Definitioner!B62<>\"\",Definitioner!B62,\"\")","v":"1,2-dibromethan"}]
[62,{"$f":"IF(Definitioner!B63<>\"\",Definitioner!B63,\"\")","v":"Chlorbenzen"}]
[63,{"$f":"IF(Definitioner!B64<>\"\",Definitioner!B64,\"\")","v":"1,2-dichlorbenzen"}]
[64,{"$f":"IF(Definitioner!B65<>\"\",Definitioner!B65,\"\")","v":"1,4-dichlorbenzen"}]
[65,{"$f":"IF(Definitioner!B66<>\"\",Definitioner!B66,\"\")","v":"Chlorethan"}]
[66,{"$f":"IF(Definitioner!B67<>\"\",Definitioner!B67,\"\")","v":"TBA (tert-butyl-alkohol)"}]
[67,{"$f":"IF(Definitioner!B68<>\"\",Definitioner!B68,\"\")","v":"methanol"}]
[68,{"$f":"IF(Definitioner!B69<>\"\",Definitioner!B69,\"\")","v":"Ethanol"}]
[69,{"$f":"IF(Definitioner!B70<>\"\",Definitioner!B70,\"\")","v":"diethylether"}]
[70,{"$f":"IF(Definitioner!B71<>\"\",Definitioner!B71,\"\")","v":"acetone"}]
[71,{"$f":"IF(Definitioner!B72<>\"\",Definitioner!B72,\"\")","v":"isopropanol"}]
[72,{"$f":"IF(Definitioner!B73<>\"\",Definitioner!B73,\"\")","v":"1-propanol"}]
[73,{"$f":"IF(Definitioner!B74<>\"\",Definitioner!B74,\"\")","v":"diisopropylether"}]
[74,{"$f":"IF(Definitioner!B75<>\"\",Definitioner!B75,\"\")","v":"MEK"}]
[75,{"$f":"IF(Definitioner!B76<>\"\",Definitioner!B76,\"\")","v":"ethylacetat"}]
[76,{"$f":"IF(Definitioner!B77<>\"\",Definitioner!B77,\"\")","v":"methylacrylat"}]
[77,{"$f":"IF(Definitioner!B78<>\"\",Definitioner!B78,\"\")","v":"isobutanol"}]
[78,{"$f":"IF(Definitioner!B79<>\"\",Definitioner!B79,\"\")","v":"isopropylacetat"}]
[79,{"$f":"IF(Definitioner!B80<>\"\",Definitioner!B80,\"\")","v":"1-butanol"}]
[80,{"$f":"IF(Definitioner!B81<>\"\",Definitioner!B81,\"\")","v":"methylmetacrylat"}]
[81,{"$f":"IF(Definitioner!B82<>\"\",Definitioner!B82,\"\")","v":"MIBK"}]
[82,{"$f":"IF(Definitioner!B83<>\"\",Definitioner!B83,\"\")","v":"isobutylacetat"}]
[83,{"$f":"IF(Definitioner!B84<>\"\",Definitioner!B84,\"\")","v":"butylacetat"}]
[84,{"$f":"IF(Definitioner!B85<>\"\",Definitioner!B85,\"\")","v":"Vinylacetat"}]
[85,{"$f":"IF(Definitioner!B86<>\"\",Definitioner!B86,\"\")","v":"Acetaldehyd"}]
[86,{"$f":"IF(Definitioner!B87<>\"\",Definitioner!B87,\"\")","v":"Sum af xylener"}]
[87,{"$f":"IF(Definitioner!B88<>\"\",Definitioner!B88,\"\")","v":"Svovl, total"}]
[88,{"$f":"IF(Definitioner!B89<>\"\",Definitioner!B89,\"\")","v":"Chloroform"}]
[89,{"$f":"IF(Definitioner!B90<>\"\",Definitioner!B90,\"\")","v":"1,1,1-trichlorethan"}]
[90,{"$f":"IF(Definitioner!B91<>\"\",Definitioner!B91,\"\")","v":"Cyanid, total"}]
[91,{"$f":"IF(Definitioner!B92<>\"\",Definitioner!B92,\"\")","v":"Pentachlorphenol"}]
[92,{"$f":"IF(Definitioner!B93<>\"\",Definitioner!B93,\"\")","v":"Barium"}]
[93,{"$f":"IF(Definitioner!B94<>\"\",Definitioner!B94,\"\")","v":"PCB(total)*5"}]
[94,{"$f":"IF(Definitioner!B95<>\"\",Definitioner!B95,\"\")","v":"Chlorparaffiner C10-C13"}]
[95,{"$f":"IF(Definitioner!B96<>\"\",Definitioner!B96,\"\")","v":"Chlorparaffiner C14-C17"}]
[96,{"$f":"IF(Definitioner!B97<>\"\",Definitioner!B97,\"\")","v":"Asbest"}]
[97,{"$f":"IF(Definitioner!B98<>\"\",Definitioner!B98,\"\")","v":"Aquatic Acute 1(H400)"}]
[98,{"$f":"IF(Definitioner!B99<>\"\",Definitioner!B99,\"\")","v":"Aquatic Chronic 1 (H410)"}]
[99,{"$f":"IF(Definitioner!B100<>\"\",Definitioner!B100,\"\")","v":"Tørstof"}]

{"sheet":"5","index":12,"n_rows":102,"n_cols":5,"rows_kept":102,"cut":false,"hidden":true,"merged":[]}
["Odense Kommune"]
[null,null,"<","<=",">"]
["Parameter ID","Parameter","Uforurenet","Lettere forurenet","Kraftigt forurenet"]
[0,{"$f":"IF(Definitioner!B2<>\"\",Definitioner!B2,\"\")","v":"Dybde"}]
[1,{"$f":"IF(Definitioner!B3<>\"\",Definitioner!B3,\"\")","v":"Arsen"},20,20,20]
[2,{"$f":"IF(Definitioner!B4<>\"\",Definitioner!B4,\"\")","v":"Bly "},40,400,400]
[3,{"$f":"IF(Definitioner!B5<>\"\",Definitioner!B5,\"\")","v":"Cadmium"},0.5,5,5]
[4,{"$f":"IF(Definitioner!B6<>\"\",Definitioner!B6,\"\")","v":"Chrom VI"}]
[5,{"$f":"IF(Definitioner!B7<>\"\",Definitioner!B7,\"\")","v":"Chrom total"},500,1000,1000]
[6,{"$f":"IF(Definitioner!B8<>\"\",Definitioner!B8,\"\")","v":"Kobber "},500,1000,1000]
[7,{"$f":"IF(Definitioner!B9<>\"\",Definitioner!B9,\"\")","v":"Kviksølv"},1,3,3]
[8,{"$f":"IF(Definitioner!B10<>\"\",Definitioner!B10,\"\")","v":"Nikkel"},30,30,30]
[9,{"$f":"IF(Definitioner!B11<>\"\",Definitioner!B11,\"\")","v":"Tin"}]
[10,{"$f":"IF(Definitioner!B12<>\"\",Definitioner!B12,\"\")","v":"Zink"},500,1000,1000]
[11,{"$f":"IF(Definitioner!B13<>\"\",Definitioner!B13,\"\")","v":"Sum C6-C35 (Reflab1)"},100,250,250]
[12,{"$f":"IF(Definitioner!B14<>\"\",Definitioner!B14,\"\")","v":"C6-C10 (Reflab1)"},25,35,35]
[13,{"$f":"IF(Definitioner!B15<>\"\",Definitioner!B15,\"\")","v":"C10-C25 (Reflab1 gl.)"},50,125,125]
[14,{"$f":"IF(Definitioner!B16<>\"\",Definitioner!B16,\"\")","v":"C25-C35 (Reflab1 gl.)"},100,250,250]
[15,{"$f":"IF(Definitioner!B17<>\"\",Definitioner!B17,\"\")","v":"BTEX, sum"}]
[16,{"$f":"IF(Definitioner!B18<>\"\",Definitioner!B18,\"\")","v":"Benzen"}]
[17,{"$f":"IF(Definitioner!B19<>\"\",Definitioner!B19,\"\")","v":"Naphtalen"}]
[18,{"$f":"IF(Definitioner!B20<>\"\",Definitioner!B20,\"\")","v":"Sum af 7 PAH'er"},4,40,40]
[19,{"$f":"IF(Definitioner!B21<>\"\",Definitioner!B21,\"\")","v":"Benz(a)pyren"},0.3,3,3]
[20,{"$f":"IF(Definitioner!B22<>\"\",Definitioner!B22,\"\")","v":"Dibenz(a,h)anthracen"},0.3,3,3]
[21,{"$f":"IF(Definitioner!B23<>\"\",Definitioner!B23,\"\")","v":"Phenoler, sum"}]
[22,{"$f":"IF(Definitioner!B24<>\"\",Definitioner!B24,\"\")","v":"Cyanid, total"}]
[23,{"$f":"IF(Definitioner!B25<>\"\",Definitioner!B25,\"\")","v":"Cyanid, syreflygtig"}]
[24,{"$f":"IF(Definitioner!B26<>\"\",Definitioner!B26,\"\")","v":"Fluoranthen"}]
[25,{"$f":"IF(Definitioner!B27<>\"\",Definitioner!B27,\"\")","v":"Benz(b+j+k)fluoranthen"}]
[26,{"$f":"IF(Definitioner!B28<>\"\",Definitioner!B28,\"\")","v":"Indeno(1,2,3-cd)pyren"}]
[27,{"$f":"IF(Definitioner!B29<>\"\",Definitioner!B29,\"\")","v":"Chrom (bortset fra VI)"}]
[28,{"$f":"IF(Definitioner!B30<>\"\",Definitioner!B30,\"\")","v":"Sum C6-C40 (Reflab4)"},150,375,375]
[29,{"$f":"IF(Definitioner!B31<>\"\",Definitioner!B31,\"\")","v":"C6-C10 (Reflab4)"},25,35,35]
[30,{"$f":"IF(Definitioner!B32<>\"\",Definitioner!B32,\"\")","v":"C10-C20 (Reflab4)"}]
[31,{"$f":"IF(Definitioner!B33<>\"\",Definitioner!B33,\"\")","v":"C10-C15 (Reflab4)"},40,50,50]
[32,{"$f":"IF(Definitioner!B34<>\"\",Definitioner!B34,\"\")","v":"C15-C20 (Reflab4)"},55,70,70]
[33,{"$f":"IF(Definitioner!B35<>\"\",Definitioner!B35,\"\")","v":"C20-C40 (Reflab4)"},150,375,375]
[34,{"$f":"IF(Definitioner!B36<>\"\",Definitioner!B36,\"\")","v":"Terpentin (C7-C12) (Reflab1)"}]
[35,{"$f":"IF(Definitioner!B37<>\"\",Definitioner!B37,\"\")","v":"Petroleum (C9-C16) (Reflab1)"}]
[36,{"$f":"IF(Definitioner!B38<>\"\",Definitioner!B38,\"\")","v":"Terpentin (C7-C12) (Reflab4)"}]
[37,{"$f":"IF(Definitioner!B39<>\"\",Definitioner!B39,\"\")","v":"Petroleum (C9-C16) (Reflab4)"}]
[39,{"$f":"IF(Definitioner!B40<>\"\",Definitioner!B40,\"\")","v":"Molybdæn"}]
[40,{"$f":"IF(Definitioner!B41<>\"\",Definitioner!B41,\"\")","v":"MTBE"}]
[41,{"$f":"IF(Definitioner!B42<>\"\",Definitioner!B42,\"\")","v":"Trichlorethylen"}]
[42,{"$f":"IF(Definitioner!B43<>\"\",Definitioner!B43,\"\")","v":"Tetrachlorethylen"}]
[43,{"$f":"IF(Definitioner!B44<>\"\",Definitioner!B44,\"\")","v":"Tetrachlormethan"}]
[44,{"$f":"IF(Definitioner!B45<>\"\",Definitioner!B45,\"\")","v":"Toluen"}]
[45,{"$f":"IF(Definitioner!B46<>\"\",Definitioner!B46,\"\")","v":"Ethylbenzen"}]
[46,{"$f":"IF(Definitioner!B47<>\"\",Definitioner!B47,\"\")","v":"o-Xylen"}]
[47,{"$f":"IF(Definitioner!B48<>\"\",Definitioner!B48,\"\")","v":"m+p-Xylen"}]
[48,{"$f":"IF(Definitioner!B49<>\"\",Definitioner!B49,\"\")","v":"C20-C35 (Reflab1)"}]
[49,{"$f":"IF(Definitioner!B50<>\"\",Definitioner!B50,\"\")","v":"C15-C20 (Reflab1)"}]
[50,{"$f":"IF(Definitioner!B51<>\"\",Definitioner!B51,\"\")","v":"C10-C15 (Reflab1)"}]
[51,{"$f":"IF(Definitioner!B52<>\"\",Definitioner!B52,\"\")","v":"Sum C10-C20 (Reflab4)"}]
[52,{"$f":"IF(Definitioner!B53<>\"\",Definitioner!B53,\"\")","v":"Sum C10-C20 (Reflab1)"}]
[53,{"$f":"IF(Definitioner!B54<>\"\",Definitioner!B54,\"\")","v":"Vinylchlorid"}]
[54,{"$f":"IF(Definitioner!B55<>\"\",Definitioner!B55,\"\")","v":"1,1-dichlorethylen"}]
[55,{"$f":"IF(Definitioner!B56<>\"\",Definitioner!B56,\"\")","v":"trans-1,2-dichlorethylen"}]
[56,{"$f":"IF(Definitioner!B57<>\"\",Definitioner!B57,\"\")","v":"1,1-dichlorethan"}]
[57,{"$f":"IF(Definitioner!B58<>\"\",Definitioner!B58,\"\")","v":"cis-1,2-dichlorethylen"}]
[58,{"$f":"IF(Definitioner!B59<>\"\",Definitioner!B59,\"\")","v":"Dichlormethan"}]
[59,{"$f":"IF(Definitioner!B60<>\"\",Definitioner!B60,\"\")","v":"1,1,2-trichlorethan"}]
[60,{"$f":"IF(Definitioner!B61<>\"\",Definitioner!B61,\"\")","v":"1,2-dichlorethan"}]
[61,{"$f":"IF(Definitioner!B62<>\"\",Definitioner!B62,\"\")","v":"1,2-dibromethan"}]
[62,{"$f":"IF(Definitioner!B63<>\"\",Definitioner!B63,\"\")","v":"Chlorbenzen"}]
[63,{"$f":"IF(Definitioner!B64<>\"\",Definitioner!B64,\"\")","v":"1,2-dichlorbenzen"}]
[64,{"$f":"IF(Definitioner!B65<>\"\",Definitioner!B65,\"\")","v":"1,4-dichlorbenzen"}]
[65,{"$f":"IF(Definitioner!B66<>\"\",Definitioner!B66,\"\")","v":"Chlorethan"}]
[66,{"$f":"IF(Definitioner!B67<>\"\",Definitioner!B67,\"\")","v":"TBA (tert-butyl-alkohol)"}]
[67,{"$f":"IF(Definitioner!B68<>\"\",Definitioner!B68,\"\")","v":"methanol"}]
[68,{"$f":"IF(Definitioner!B69<>\"\",Definitioner!B69,\"\")","v":"Ethanol"}]
[69,{"$f":"IF(Definitioner!B70<>\"\",Definitioner!B70,\"\")","v":"diethylether"}]
[70,{"$f":"IF(Definitioner!B71<>\"\",Definitioner!B71,\"\")","v":"acetone"}]
[71,{"$f":"IF(Definitioner!B72<>\"\",Definitioner!B72,\"\")","v":"isopropanol"}]
[72,{"$f":"IF(Definitioner!B73<>\"\",Definitioner!B73,\"\")","v":"1-propanol"}]
[73,{"$f":"IF(Definitioner!B74<>\"\",Definitioner!B74,\"\")","v":"diisopropylether"}]
[74,{"$f":"IF(Definitioner!B75<>\"\",Definitioner!B75,\"\")","v":"MEK"}]
[75,{"$f":"IF(Definitioner!B76<>\"\",Definitioner!B76,\"\")","v":"ethylacetat"}]
[76,{"$f":"IF(Definitioner!B77<>\"\",Definitioner!B77,\"\")","v":"methylacrylat"}]
[77,{"$f":"IF(Definitioner!B78<>\"\",Definitioner!B78,\"\")","v":"isobutanol"}]
[78,{"$f":"IF(Definitioner!B79<>\"\",Definitioner!B79,\"\")","v":"isopropylacetat"}]
[79,{"$f":"IF(Definitioner!B80<>\"\",Definitioner!B80,\"\")","v":"1-butanol"}]
[80,{"$f":"IF(Definitioner!B81<>\"\",Definitioner!B81,\"\")","v":"methylmetacrylat"}]
[81,{"$f":"IF(Definitioner!B82<>\"\",Definitioner!B82,\"\")","v":"MIBK"}]
[82,{"$f":"IF(Definitioner!B83<>\"\",Definitioner!B83,\"\")","v":"isobutylacetat"}]
[83,{"$f":"IF(Definitioner!B84<>\"\",Definitioner!B84,\"\")","v":"butylacetat"}]
[84,{"$f":"IF(Definitioner!B85<>\"\",Definitioner!B85,\"\")","v":"Vinylacetat"}]
[85,{"$f":"IF(Definitioner!B86<>\"\",Definitioner!B86,\"\")","v":"Acetaldehyd"}]
[86,{"$f":"IF(Definitioner!B87<>\"\",Definitioner!B87,\"\")","v":"Sum af xylener"}]
[87,{"$f":"IF(Definitioner!B88<>\"\",Definitioner!B88,\"\")","v":"Svovl, total"}]
[88,{"$f":"IF(Definitioner!B89<>\"\",Definitioner!B89,\"\")","v":"Chloroform"}]
[89,{"$f":"IF(Definitioner!B90<>\"\",Definitioner!B90,\"\")","v":"1,1,1-trichlorethan"}]
[90,{"$f":"IF(Definitioner!B91<>\"\",Definitioner!B91,\"\")","v":"Cyanid, total"}]
[91,{"$f":"IF(Definitioner!B92<>\"\",Definitioner!B92,\"\")","v":"Pentachlorphenol"}]
[92,{"$f":"IF(Definitioner!B93<>\"\",Definitioner!B93,\"\")","v":"Barium"}]
[93,{"$f":"IF(Definitioner!B94<>\"\",Definitioner!B94,\"\")","v":"PCB(total)*5"}]
[94,{"$f":"IF(Definitioner!B95<>\"\",Definitioner!B95,\"\")","v":"Chlorparaffiner C10-C13"}]
[95,{"$f":"IF(Definitioner!B96<>\"\",Definitioner!B96,\"\")","v":"Chlorparaffiner C14-C17"}]
[96,{"$f":"IF(Definitioner!B97<>\"\",Definitioner!B97,\"\")","v":"Asbest"}]
[97,{"$f":"IF(Definitioner!B98<>\"\",Definitioner!B98,\"\")","v":"Aquatic Acute 1(H400)"}]
[98,{"$f":"IF(Definitioner!B99<>\"\",Definitioner!B99,\"\")","v":"Aquatic Chronic 1 (H410)"}]
[99,{"$f":"IF(Definitioner!B100<>\"\",Definitioner!B100,\"\")","v":"Tørstof"}]

{"sheet":"6","index":13,"n_rows":102,"n_cols":6,"rows_kept":102,"cut":false,"hidden":true,"merged":[]}
["Københavns Kommune Jordregulativ 2012"]
[null,null,"<=","<=",">",">"]
["Parameter ID","Parameter","Kategori 1","Kategori 2","Udenfor Kat.","Skal renses"]
[0,{"$f":"IF(Definitioner!B2<>\"\",Definitioner!B2,\"\")","v":"Dybde"}]
[1,{"$f":"IF(Definitioner!B3<>\"\",Definitioner!B3,\"\")","v":"Arsen"},20,20,20]
[2,{"$f":"IF(Definitioner!B4<>\"\",Definitioner!B4,\"\")","v":"Bly "},40,400,400]
[3,{"$f":"IF(Definitioner!B5<>\"\",Definitioner!B5,\"\")","v":"Cadmium"},0.5,5,5]
[4,{"$f":"IF(Definitioner!B6<>\"\",Definitioner!B6,\"\")","v":"Chrom VI"}]
[5,{"$f":"IF(Definitioner!B7<>\"\",Definitioner!B7,\"\")","v":"Chrom total"},500,1000,1000]
[6,{"$f":"IF(Definitioner!B8<>\"\",Definitioner!B8,\"\")","v":"Kobber "},500,1000,1000]
[7,{"$f":"IF(Definitioner!B9<>\"\",Definitioner!B9,\"\")","v":"Kviksølv"},1,3,3]
[8,{"$f":"IF(Definitioner!B10<>\"\",Definitioner!B10,\"\")","v":"Nikkel"}]
[9,{"$f":"IF(Definitioner!B11<>\"\",Definitioner!B11,\"\")","v":"Tin"}]
[10,{"$f":"IF(Definitioner!B12<>\"\",Definitioner!B12,\"\")","v":"Zink"},500,1000,1000]
[11,{"$f":"IF(Definitioner!B13<>\"\",Definitioner!B13,\"\")","v":"Sum C6-C35 (Reflab1)"},null,null,null,300]
[12,{"$f":"IF(Definitioner!B14<>\"\",Definitioner!B14,\"\")","v":"C6-C10 (Reflab1)"},null,null,null,50]
[13,{"$f":"IF(Definitioner!B15<>\"\",Definitioner!B15,\"\")","v":"C10-C25 (Reflab1 gl.)"}]
[14,{"$f":"IF(Definitioner!B16<>\"\",Definitioner!B16,\"\")","v":"C25-C35 (Reflab1 gl.)"}]
[15,{"$f":"IF(Definitioner!B17<>\"\",Definitioner!B17,\"\")","v":"BTEX, sum"}]
[16,{"$f":"IF(Definitioner!B18<>\"\",Definitioner!B18,\"\")","v":"Benzen"}]
[17,{"$f":"IF(Definitioner!B19<>\"\",Definitioner!B19,\"\")","v":"Naphtalen"},null,null,null,15]
[18,{"$f":"IF(Definitioner!B20<>\"\",Definitioner!B20,\"\")","v":"Sum af 7 PAH'er"},4,40,40,75]
[19,{"$f":"IF(Definitioner!B21<>\"\",Definitioner!B21,\"\")","v":"Benz(a)pyren"},0.3,3,3]
[20,{"$f":"IF(Definitioner!B22<>\"\",Definitioner!B22,\"\")","v":"Dibenz(a,h)anthracen"},0.3,3,3]
[21,{"$f":"IF(Definitioner!B23<>\"\",Definitioner!B23,\"\")","v":"Phenoler, sum"}]
[22,{"$f":"IF(Definitioner!B24<>\"\",Definitioner!B24,\"\")","v":"Cyanid, total"}]
[23,{"$f":"IF(Definitioner!B25<>\"\",Definitioner!B25,\"\")","v":"Cyanid, syreflygtig"}]
[24,{"$f":"IF(Definitioner!B26<>\"\",Definitioner!B26,\"\")","v":"Fluoranthen"}]
[25,{"$f":"IF(Definitioner!B27<>\"\",Definitioner!B27,\"\")","v":"Benz(b+j+k)fluoranthen"}]
[26,{"$f":"IF(Definitioner!B28<>\"\",Definitioner!B28,\"\")","v":"Indeno(1,2,3-cd)pyren"}]
[27,{"$f":"IF(Definitioner!B29<>\"\",Definitioner!B29,\"\")","v":"Chrom (bortset fra VI)"}]
[28,{"$f":"IF(Definitioner!B30<>\"\",Definitioner!B30,\"\")","v":"Sum C6-C40 (Reflab4)"}]
[29,{"$f":"IF(Definitioner!B31<>\"\",Definitioner!B31,\"\")","v":"C6-C10 (Reflab4)"}]
[30,{"$f":"IF(Definitioner!B32<>\"\",Definitioner!B32,\"\")","v":"C10-C20 (Reflab4)"}]
[31,{"$f":"IF(Definitioner!B33<>\"\",Definitioner!B33,\"\")","v":"C10-C15 (Reflab4)"}]
[32,{"$f":"IF(Definitioner!B34<>\"\",Definitioner!B34,\"\")","v":"C15-C20 (Reflab4)"}]
[33,{"$f":"IF(Definitioner!B35<>\"\",Definitioner!B35,\"\")","v":"C20-C40 (Reflab4)"}]
[34,{"$f":"IF(Definitioner!B36<>\"\",Definitioner!B36,\"\")","v":"Terpentin (C7-C12) (Reflab1)"}]
[35,{"$f":"IF(Definitioner!B37<>\"\",Definitioner!B37,\"\")","v":"Petroleum (C9-C16) (Reflab1)"}]
[36,{"$f":"IF(Definitioner!B38<>\"\",Definitioner!B38,\"\")","v":"Terpentin (C7-C12) (Reflab4)"}]
[37,{"$f":"IF(Definitioner!B39<>\"\",Definitioner!B39,\"\")","v":"Petroleum (C9-C16) (Reflab4)"}]
[39,{"$f":"IF(Definitioner!B40<>\"\",Definitioner!B40,\"\")","v":"Molybdæn"}]
[40,{"$f":"IF(Definitioner!B41<>\"\",Definitioner!B41,\"\")","v":"MTBE"}]
[41,{"$f":"IF(Definitioner!B42<>\"\",Definitioner!B42,\"\")","v":"Trichlorethylen"}]
[42,{"$f":"IF(Definitioner!B43<>\"\",Definitioner!B43,\"\")","v":"Tetrachlorethylen"}]
[43,{"$f":"IF(Definitioner!B44<>\"\",Definitioner!B44,\"\")","v":"Tetrachlormethan"}]
[44,{"$f":"IF(Definitioner!B45<>\"\",Definitioner!B45,\"\")","v":"Toluen"}]
[45,{"$f":"IF(Definitioner!B46<>\"\",Definitioner!B46,\"\")","v":"Ethylbenzen"}]
[46,{"$f":"IF(Definitioner!B47<>\"\",Definitioner!B47,\"\")","v":"o-Xylen"}]
[47,{"$f":"IF(Definitioner!B48<>\"\",Definitioner!B48,\"\")","v":"m+p-Xylen"}]
[48,{"$f":"IF(Definitioner!B49<>\"\",Definitioner!B49,\"\")","v":"C20-C35 (Reflab1)"},null,null,null,300]
[49,{"$f":"IF(Definitioner!B50<>\"\",Definitioner!B50,\"\")","v":"C15-C20 (Reflab1)"}]
[50,{"$f":"IF(Definitioner!B51<>\"\",Definitioner!B51,\"\")","v":"C10-C15 (Reflab1)"}]
[51,{"$f":"IF(Definitioner!B52<>\"\",Definitioner!B52,\"\")","v":"Sum C10-C20 (Reflab4)"}]
[52,{"$f":"IF(Definitioner!B53<>\"\",Definitioner!B53,\"\")","v":"Sum C10-C20 (Reflab1)"},null,null,null,100]
[53,{"$f":"IF(Definitioner!B54<>\"\",Definitioner!B54,\"\")","v":"Vinylchlorid"}]
[54,{"$f":"IF(Definitioner!B55<>\"\",Definitioner!B55,\"\")","v":"1,1-dichlorethylen"}]
[55,{"$f":"IF(Definitioner!B56<>\"\",Definitioner!B56,\"\")","v":"trans-1,2-dichlorethylen"}]
[56,{"$f":"IF(Definitioner!B57<>\"\",Definitioner!B57,\"\")","v":"1,1-dichlorethan"}]
[57,{"$f":"IF(Definitioner!B58<>\"\",Definitioner!B58,\"\")","v":"cis-1,2-dichlorethylen"}]
[58,{"$f":"IF(Definitioner!B59<>\"\",Definitioner!B59,\"\")","v":"Dichlormethan"}]
[59,{"$f":"IF(Definitioner!B60<>\"\",Definitioner!B60,\"\")","v":"1,1,2-trichlorethan"}]
[60,{"$f":"IF(Definitioner!B61<>\"\",Definitioner!B61,\"\")","v":"1,2-dichlorethan"}]
[61,{"$f":"IF(Definitioner!B62<>\"\",Definitioner!B62,\"\")","v":"1,2-dibromethan"}]
[62,{"$f":"IF(Definitioner!B63<>\"\",Definitioner!B63,\"\")","v":"Chlorbenzen"}]
[63,{"$f":"IF(Definitioner!B64<>\"\",Definitioner!B64,\"\")","v":"1,2-dichlorbenzen"}]
[64,{"$f":"IF(Definitioner!B65<>\"\",Definitioner!B65,\"\")","v":"1,4-dichlorbenzen"}]
[65,{"$f":"IF(Definitioner!B66<>\"\",Definitioner!B66,\"\")","v":"Chlorethan"}]
[66,{"$f":"IF(Definitioner!B67<>\"\",Definitioner!B67,\"\")","v":"TBA (tert-butyl-alkohol)"}]
[67,{"$f":"IF(Definitioner!B68<>\"\",Definitioner!B68,\"\")","v":"methanol"}]
[68,{"$f":"IF(Definitioner!B69<>\"\",Definitioner!B69,\"\")","v":"Ethanol"}]
[69,{"$f":"IF(Definitioner!B70<>\"\",Definitioner!B70,\"\")","v":"diethylether"}]
[70,{"$f":"IF(Definitioner!B71<>\"\",Definitioner!B71,\"\")","v":"acetone"}]
[71,{"$f":"IF(Definitioner!B72<>\"\",Definitioner!B72,\"\")","v":"isopropanol"}]
[72,{"$f":"IF(Definitioner!B73<>\"\",Definitioner!B73,\"\")","v":"1-propanol"}]
[73,{"$f":"IF(Definitioner!B74<>\"\",Definitioner!B74,\"\")","v":"diisopropylether"}]
[74,{"$f":"IF(Definitioner!B75<>\"\",Definitioner!B75,\"\")","v":"MEK"}]
[75,{"$f":"IF(Definitioner!B76<>\"\",Definitioner!B76,\"\")","v":"ethylacetat"}]
[76,{"$f":"IF(Definitioner!B77<>\"\",Definitioner!B77,\"\")","v":"methylacrylat"}]
[77,{"$f":"IF(Definitioner!B78<>\"\",Definitioner!B78,\"\")","v":"isobutanol"}]
[78,{"$f":"IF(Definitioner!B79<>\"\",Definitioner!B79,\"\")","v":"isopropylacetat"}]
[79,{"$f":"IF(Definitioner!B80<>\"\",Definitioner!B80,\"\")","v":"1-butanol"}]
[80,{"$f":"IF(Definitioner!B81<>\"\",Definitioner!B81,\"\")","v":"methylmetacrylat"}]
[81,{"$f":"IF(Definitioner!B82<>\"\",Definitioner!B82,\"\")","v":"MIBK"}]
[82,{"$f":"IF(Definitioner!B83<>\"\",Definitioner!B83,\"\")","v":"isobutylacetat"}]
[83,{"$f":"IF(Definitioner!B84<>\"\",Definitioner!B84,\"\")","v":"butylacetat"}]
[84,{"$f":"IF(Definitioner!B85<>\"\",Definitioner!B85,\"\")","v":"Vinylacetat"}]
[85,{"$f":"IF(Definitioner!B86<>\"\",Definitioner!B86,\"\")","v":"Acetaldehyd"}]
[86,{"$f":"IF(Definitioner!B87<>\"\",Definitioner!B87,\"\")","v":"Sum af xylener"}]
[87,{"$f":"IF(Definitioner!B88<>\"\",Definitioner!B88,\"\")","v":"Svovl, total"}]
[88,{"$f":"IF(Definitioner!B89<>\"\",Definitioner!B89,\"\")","v":"Chloroform"}]
[89,{"$f":"IF(Definitioner!B90<>\"\",Definitioner!B90,\"\")","v":"1,1,1-trichlorethan"}]
[90,{"$f":"IF(Definitioner!B91<>\"\",Definitioner!B91,\"\")","v":"Cyanid, total"}]
[91,{"$f":"IF(Definitioner!B92<>\"\",Definitioner!B92,\"\")","v":"Pentachlorphenol"}]
[92,{"$f":"IF(Definitioner!B93<>\"\",Definitioner!B93,\"\")","v":"Barium"}]
[93,{"$f":"IF(Definitioner!B94<>\"\",Definitioner!B94,\"\")","v":"PCB(total)*5"}]
[94,{"$f":"IF(Definitioner!B95<>\"\",Definitioner!B95,\"\")","v":"Chlorparaffiner C10-C13"}]
[95,{"$f":"IF(Definitioner!B96<>\"\",Definitioner!B96,\"\")","v":"Chlorparaffiner C14-C17"}]
[96,{"$f":"IF(Definitioner!B97<>\"\",Definitioner!B97,\"\")","v":"Asbest"}]
[97,{"$f":"IF(Definitioner!B98<>\"\",Definitioner!B98,\"\")","v":"Aquatic Acute 1(H400)"}]
[98,{"$f":"IF(Definitioner!B99<>\"\",Definitioner!B99,\"\")","v":"Aquatic Chronic 1 (H410)"}]
[99,{"$f":"IF(Definitioner!B100<>\"\",Definitioner!B100,\"\")","v":"Tørstof"}]

{"sheet":"7","index":14,"n_rows":102,"n_cols":7,"rows_kept":102,"cut":false,"hidden":true,"merged":[]}
["Kalvebod Miljøcenter Depot Syd"]
[null,null,"<=","<=",">",">",">"]
["Parameter ID","Parameter","Syd hvis Klasse > 1","Nord hvis Klasse >1","Kan ikke modtages","Skal renses"]
[0,{"$f":"IF(Definitioner!B2<>\"\",Definitioner!B2,\"\")","v":"Dybde"}]
[1,{"$f":"IF(Definitioner!B3<>\"\",Definitioner!B3,\"\")","v":"Arsen"},null,1000,1000]
[2,{"$f":"IF(Definitioner!B4<>\"\",Definitioner!B4,\"\")","v":"Bly "},1000,2500,2500]
[3,{"$f":"IF(Definitioner!B5<>\"\",Definitioner!B5,\"\")","v":"Cadmium"},8,1000,1000]
[4,{"$f":"IF(Definitioner!B6<>\"\",Definitioner!B6,\"\")","v":"Chrom VI"},null,1000,1000]
[5,{"$f":"IF(Definitioner!B7<>\"\",Definitioner!B7,\"\")","v":"Chrom total"},1000,10000,10000]
[6,{"$f":"IF(Definitioner!B8<>\"\",Definitioner!B8,\"\")","v":"Kobber "},1000,50000,50000]
[7,{"$f":"IF(Definitioner!B9<>\"\",Definitioner!B9,\"\")","v":"Kviksølv"},10,10,10]
[8,{"$f":"IF(Definitioner!B10<>\"\",Definitioner!B10,\"\")","v":"Nikkel"},250,1000,1000]
[9,{"$f":"IF(Definitioner!B11<>\"\",Definitioner!B11,\"\")","v":"Tin"}]
[10,{"$f":"IF(Definitioner!B12<>\"\",Definitioner!B12,\"\")","v":"Zink"},2500,50000,50000]
[11,{"$f":"IF(Definitioner!B13<>\"\",Definitioner!B13,\"\")","v":"Sum C6-C35 (Reflab1)"},null,null,null,300]
[12,{"$f":"IF(Definitioner!B14<>\"\",Definitioner!B14,\"\")","v":"C6-C10 (Reflab1)"},null,null,null,50]
[13,{"$f":"IF(Definitioner!B15<>\"\",Definitioner!B15,\"\")","v":"C10-C25 (Reflab1 gl.)"}]
[14,{"$f":"IF(Definitioner!B16<>\"\",Definitioner!B16,\"\")","v":"C25-C35 (Reflab1 gl.)"}]
[15,{"$f":"IF(Definitioner!B17<>\"\",Definitioner!B17,\"\")","v":"BTEX, sum"},15,15,15]
[16,{"$f":"IF(Definitioner!B18<>\"\",Definitioner!B18,\"\")","v":"Benzen"}]
[17,{"$f":"IF(Definitioner!B19<>\"\",Definitioner!B19,\"\")","v":"Naphtalen"},5,5,5,15]
[18,{"$f":"IF(Definitioner!B20<>\"\",Definitioner!B20,\"\")","v":"Sum af 7 PAH'er"},null,null,null,75]
[19,{"$f":"IF(Definitioner!B21<>\"\",Definitioner!B21,\"\")","v":"Benz(a)pyren"},5,5,5]
[20,{"$f":"IF(Definitioner!B22<>\"\",Definitioner!B22,\"\")","v":"Dibenz(a,h)anthracen"},0.9,0.9,0.9]
[21,{"$f":"IF(Definitioner!B23<>\"\",Definitioner!B23,\"\")","v":"Phenoler, sum"}]
[22,{"$f":"IF(Definitioner!B24<>\"\",Definitioner!B24,\"\")","v":"Cyanid, total"}]
[23,{"$f":"IF(Definitioner!B25<>\"\",Definitioner!B25,\"\")","v":"Cyanid, syreflygtig"}]
[24,{"$f":"IF(Definitioner!B26<>\"\",Definitioner!B26,\"\")","v":"Fluoranthen"}]
[25,{"$f":"IF(Definitioner!B27<>\"\",Definitioner!B27,\"\")","v":"Benz(b+j+k)fluoranthen"}]
[26,{"$f":"IF(Definitioner!B28<>\"\",Definitioner!B28,\"\")","v":"Indeno(1,2,3-cd)pyren"}]
[27,{"$f":"IF(Definitioner!B29<>\"\",Definitioner!B29,\"\")","v":"Chrom (bortset fra VI)"}]
[28,{"$f":"IF(Definitioner!B30<>\"\",Definitioner!B30,\"\")","v":"Sum C6-C40 (Reflab4)"}]
[29,{"$f":"IF(Definitioner!B31<>\"\",Definitioner!B31,\"\")","v":"C6-C10 (Reflab4)"}]
[30,{"$f":"IF(Definitioner!B32<>\"\",Definitioner!B32,\"\")","v":"C10-C20 (Reflab4)"}]
[31,{"$f":"IF(Definitioner!B33<>\"\",Definitioner!B33,\"\")","v":"C10-C15 (Reflab4)"}]
[32,{"$f":"IF(Definitioner!B34<>\"\",Definitioner!B34,\"\")","v":"C15-C20 (Reflab4)"}]
[33,{"$f":"IF(Definitioner!B35<>\"\",Definitioner!B35,\"\")","v":"C20-C40 (Reflab4)"}]
[34,{"$f":"IF(Definitioner!B36<>\"\",Definitioner!B36,\"\")","v":"Terpentin (C7-C12) (Reflab1)"}]
[35,{"$f":"IF(Definitioner!B37<>\"\",Definitioner!B37,\"\")","v":"Petroleum (C9-C16) (Reflab1)"}]
[36,{"$f":"IF(Definitioner!B38<>\"\",Definitioner!B38,\"\")","v":"Terpentin (C7-C12) (Reflab4)"}]
[37,{"$f":"IF(Definitioner!B39<>\"\",Definitioner!B39,\"\")","v":"Petroleum (C9-C16) (Reflab4)"}]
[39,{"$f":"IF(Definitioner!B40<>\"\",Definitioner!B40,\"\")","v":"Molybdæn"}]
[40,{"$f":"IF(Definitioner!B41<>\"\",Definitioner!B41,\"\")","v":"MTBE"}]
[41,{"$f":"IF(Definitioner!B42<>\"\",Definitioner!B42,\"\")","v":"Trichlorethylen"}]
[42,{"$f":"IF(Definitioner!B43<>\"\",Definitioner!B43,\"\")","v":"Tetrachlorethylen"}]
[43,{"$f":"IF(Definitioner!B44<>\"\",Definitioner!B44,\"\")","v":"Tetrachlormethan"}]
[44,{"$f":"IF(Definitioner!B45<>\"\",Definitioner!B45,\"\")","v":"Toluen"}]
[45,{"$f":"IF(Definitioner!B46<>\"\",Definitioner!B46,\"\")","v":"Ethylbenzen"}]
[46,{"$f":"IF(Definitioner!B47<>\"\",Definitioner!B47,\"\")","v":"o-Xylen"}]
[47,{"$f":"IF(Definitioner!B48<>\"\",Definitioner!B48,\"\")","v":"m+p-Xylen"}]
[48,{"$f":"IF(Definitioner!B49<>\"\",Definitioner!B49,\"\")","v":"C20-C35 (Reflab1)"},null,null,null,300]
[49,{"$f":"IF(Definitioner!B50<>\"\",Definitioner!B50,\"\")","v":"C15-C20 (Reflab1)"}]
[50,{"$f":"IF(Definitioner!B51<>\"\",Definitioner!B51,\"\")","v":"C10-C15 (Reflab1)"}]
[51,{"$f":"IF(Definitioner!B52<>\"\",Definitioner!B52,\"\")","v":"Sum C10-C20 (Reflab4)"}]
[52,{"$f":"IF(Definitioner!B53<>\"\",Definitioner!B53,\"\")","v":"Sum C10-C20 (Reflab1)"},null,null,null,100]
[53,{"$f":"IF(Definitioner!B54<>\"\",Definitioner!B54,\"\")","v":"Vinylchlorid"}]
[54,{"$f":"IF(Definitioner!B55<>\"\",Definitioner!B55,\"\")","v":"1,1-dichlorethylen"}]
[55,{"$f":"IF(Definitioner!B56<>\"\",Definitioner!B56,\"\")","v":"trans-1,2-dichlorethylen"}]
[56,{"$f":"IF(Definitioner!B57<>\"\",Definitioner!B57,\"\")","v":"1,1-dichlorethan"}]
[57,{"$f":"IF(Definitioner!B58<>\"\",Definitioner!B58,\"\")","v":"cis-1,2-dichlorethylen"}]
[58,{"$f":"IF(Definitioner!B59<>\"\",Definitioner!B59,\"\")","v":"Dichlormethan"}]
[59,{"$f":"IF(Definitioner!B60<>\"\",Definitioner!B60,\"\")","v":"1,1,2-trichlorethan"}]
[60,{"$f":"IF(Definitioner!B61<>\"\",Definitioner!B61,\"\")","v":"1,2-dichlorethan"}]
[61,{"$f":"IF(Definitioner!B62<>\"\",Definitioner!B62,\"\")","v":"1,2-dibromethan"}]
[62,{"$f":"IF(Definitioner!B63<>\"\",Definitioner!B63,\"\")","v":"Chlorbenzen"}]
[63,{"$f":"IF(Definitioner!B64<>\"\",Definitioner!B64,\"\")","v":"1,2-dichlorbenzen"}]
[64,{"$f":"IF(Definitioner!B65<>\"\",Definitioner!B65,\"\")","v":"1,4-dichlorbenzen"}]
[65,{"$f":"IF(Definitioner!B66<>\"\",Definitioner!B66,\"\")","v":"Chlorethan"}]
[66,{"$f":"IF(Definitioner!B67<>\"\",Definitioner!B67,\"\")","v":"TBA (tert-butyl-alkohol)"}]
[67,{"$f":"IF(Definitioner!B68<>\"\",Definitioner!B68,\"\")","v":"methanol"}]
[68,{"$f":"IF(Definitioner!B69<>\"\",Definitioner!B69,\"\")","v":"Ethanol"}]
[69,{"$f":"IF(Definitioner!B70<>\"\",Definitioner!B70,\"\")","v":"diethylether"}]
[70,{"$f":"IF(Definitioner!B71<>\"\",Definitioner!B71,\"\")","v":"acetone"}]
[71,{"$f":"IF(Definitioner!B72<>\"\",Definitioner!B72,\"\")","v":"isopropanol"}]
[72,{"$f":"IF(Definitioner!B73<>\"\",Definitioner!B73,\"\")","v":"1-propanol"}]
[73,{"$f":"IF(Definitioner!B74<>\"\",Definitioner!B74,\"\")","v":"diisopropylether"}]
[74,{"$f":"IF(Definitioner!B75<>\"\",Definitioner!B75,\"\")","v":"MEK"}]
[75,{"$f":"IF(Definitioner!B76<>\"\",Definitioner!B76,\"\")","v":"ethylacetat"}]
[76,{"$f":"IF(Definitioner!B77<>\"\",Definitioner!B77,\"\")","v":"methylacrylat"}]
[77,{"$f":"IF(Definitioner!B78<>\"\",Definitioner!B78,\"\")","v":"isobutanol"}]
[78,{"$f":"IF(Definitioner!B79<>\"\",Definitioner!B79,\"\")","v":"isopropylacetat"}]
[79,{"$f":"IF(Definitioner!B80<>\"\",Definitioner!B80,\"\")","v":"1-butanol"}]
[80,{"$f":"IF(Definitioner!B81<>\"\",Definitioner!B81,\"\")","v":"methylmetacrylat"}]
[81,{"$f":"IF(Definitioner!B82<>\"\",Definitioner!B82,\"\")","v":"MIBK"}]
[82,{"$f":"IF(Definitioner!B83<>\"\",Definitioner!B83,\"\")","v":"isobutylacetat"}]
[83,{"$f":"IF(Definitioner!B84<>\"\",Definitioner!B84,\"\")","v":"butylacetat"}]
[84,{"$f":"IF(Definitioner!B85<>\"\",Definitioner!B85,\"\")","v":"Vinylacetat"}]
[85,{"$f":"IF(Definitioner!B86<>\"\",Definitioner!B86,\"\")","v":"Acetaldehyd"}]
[86,{"$f":"IF(Definitioner!B87<>\"\",Definitioner!B87,\"\")","v":"Sum af xylener"}]
[87,{"$f":"IF(Definitioner!B88<>\"\",Definitioner!B88,\"\")","v":"Svovl, total"}]
[88,{"$f":"IF(Definitioner!B89<>\"\",Definitioner!B89,\"\")","v":"Chloroform"}]
[89,{"$f":"IF(Definitioner!B90<>\"\",Definitioner!B90,\"\")","v":"1,1,1-trichlorethan"}]
[90,{"$f":"IF(Definitioner!B91<>\"\",Definitioner!B91,\"\")","v":"Cyanid, total"}]
[91,{"$f":"IF(Definitioner!B92<>\"\",Definitioner!B92,\"\")","v":"Pentachlorphenol"}]
[92,{"$f":"IF(Definitioner!B93<>\"\",Definitioner!B93,\"\")","v":"Barium"}]
[93,{"$f":"IF(Definitioner!B94<>\"\",Definitioner!B94,\"\")","v":"PCB(total)*5"}]
[94,{"$f":"IF(Definitioner!B95<>\"\",Definitioner!B95,\"\")","v":"Chlorparaffiner C10-C13"}]
[95,{"$f":"IF(Definitioner!B96<>\"\",Definitioner!B96,\"\")","v":"Chlorparaffiner C14-C17"}]
[96,{"$f":"IF(Definitioner!B97<>\"\",Definitioner!B97,\"\")","v":"Asbest"}]
[97,{"$f":"IF(Definitioner!B98<>\"\",Definitioner!B98,\"\")","v":"Aquatic Acute 1(H400)"}]
[98,{"$f":"IF(Definitioner!B99<>\"\",Definitioner!B99,\"\")","v":"Aquatic Chronic 1 (H410)"}]
[99,{"$f":"IF(Definitioner!B100<>\"\",Definitioner!B100,\"\")","v":"Tørstof"}]

{"sheet":"8","index":15,"n_rows":102,"n_cols":3,"rows_kept":102,"cut":false,"hidden":true,"merged":[]}
["Nordhavn depotet"]
[null,null,">"]
["Parameter ID","Parameter","Kan IKKE modtages"]
[0,{"$f":"IF(Definitioner!B2<>\"\",Definitioner!B2,\"\")","v":"Dybde"}]
[1,{"$f":"IF(Definitioner!B3<>\"\",Definitioner!B3,\"\")","v":"Arsen"},50]
[2,{"$f":"IF(Definitioner!B4<>\"\",Definitioner!B4,\"\")","v":"Bly "},1500]
[3,{"$f":"IF(Definitioner!B5<>\"\",Definitioner!B5,\"\")","v":"Cadmium"},10]
[4,{"$f":"IF(Definitioner!B6<>\"\",Definitioner!B6,\"\")","v":"Chrom VI"},500]
[5,{"$f":"IF(Definitioner!B7<>\"\",Definitioner!B7,\"\")","v":"Chrom total"},2500]
[6,{"$f":"IF(Definitioner!B8<>\"\",Definitioner!B8,\"\")","v":"Kobber "},2500]
[7,{"$f":"IF(Definitioner!B9<>\"\",Definitioner!B9,\"\")","v":"Kviksølv"},10]
[8,{"$f":"IF(Definitioner!B10<>\"\",Definitioner!B10,\"\")","v":"Nikkel"},500]
[9,{"$f":"IF(Definitioner!B11<>\"\",Definitioner!B11,\"\")","v":"Tin"}]
[10,{"$f":"IF(Definitioner!B12<>\"\",Definitioner!B12,\"\")","v":"Zink"},2500]
[11,{"$f":"IF(Definitioner!B13<>\"\",Definitioner!B13,\"\")","v":"Sum C6-C35 (Reflab1)"},300]
[12,{"$f":"IF(Definitioner!B14<>\"\",Definitioner!B14,\"\")","v":"C6-C10 (Reflab1)"},50]
[13,{"$f":"IF(Definitioner!B15<>\"\",Definitioner!B15,\"\")","v":"C10-C25 (Reflab1 gl.)"}]
[14,{"$f":"IF(Definitioner!B16<>\"\",Definitioner!B16,\"\")","v":"C25-C35 (Reflab1 gl.)"}]
[15,{"$f":"IF(Definitioner!B17<>\"\",Definitioner!B17,\"\")","v":"BTEX, sum"},15]
[16,{"$f":"IF(Definitioner!B18<>\"\",Definitioner!B18,\"\")","v":"Benzen"}]
[17,{"$f":"IF(Definitioner!B19<>\"\",Definitioner!B19,\"\")","v":"Naphtalen"},5]
[18,{"$f":"IF(Definitioner!B20<>\"\",Definitioner!B20,\"\")","v":"Sum af 7 PAH'er"},75]
[19,{"$f":"IF(Definitioner!B21<>\"\",Definitioner!B21,\"\")","v":"Benz(a)pyren"},15]
[20,{"$f":"IF(Definitioner!B22<>\"\",Definitioner!B22,\"\")","v":"Dibenz(a,h)anthracen"},2]
[21,{"$f":"IF(Definitioner!B23<>\"\",Definitioner!B23,\"\")","v":"Phenoler, sum"}]
[22,{"$f":"IF(Definitioner!B24<>\"\",Definitioner!B24,\"\")","v":"Cyanid, total"}]
[23,{"$f":"IF(Definitioner!B25<>\"\",Definitioner!B25,\"\")","v":"Cyanid, syreflygtig"}]
[24,{"$f":"IF(Definitioner!B26<>\"\",Definitioner!B26,\"\")","v":"Fluoranthen"}]
[25,{"$f":"IF(Definitioner!B27<>\"\",Definitioner!B27,\"\")","v":"Benz(b+j+k)fluoranthen"}]
[26,{"$f":"IF(Definitioner!B28<>\"\",Definitioner!B28,\"\")","v":"Indeno(1,2,3-cd)pyren"}]
[27,{"$f":"IF(Definitioner!B29<>\"\",Definitioner!B29,\"\")","v":"Chrom (bortset fra VI)"}]
[28,{"$f":"IF(Definitioner!B30<>\"\",Definitioner!B30,\"\")","v":"Sum C6-C40 (Reflab4)"}]
[29,{"$f":"IF(Definitioner!B31<>\"\",Definitioner!B31,\"\")","v":"C6-C10 (Reflab4)"}]
[30,{"$f":"IF(Definitioner!B32<>\"\",Definitioner!B32,\"\")","v":"C10-C20 (Reflab4)"}]
[31,{"$f":"IF(Definitioner!B33<>\"\",Definitioner!B33,\"\")","v":"C10-C15 (Reflab4)"}]
[32,{"$f":"IF(Definitioner!B34<>\"\",Definitioner!B34,\"\")","v":"C15-C20 (Reflab4)"}]
[33,{"$f":"IF(Definitioner!B35<>\"\",Definitioner!B35,\"\")","v":"C20-C40 (Reflab4)"}]
[34,{"$f":"IF(Definitioner!B36<>\"\",Definitioner!B36,\"\")","v":"Terpentin (C7-C12) (Reflab1)"}]
[35,{"$f":"IF(Definitioner!B37<>\"\",Definitioner!B37,\"\")","v":"Petroleum (C9-C16) (Reflab1)"}]
[36,{"$f":"IF(Definitioner!B38<>\"\",Definitioner!B38,\"\")","v":"Terpentin (C7-C12) (Reflab4)"}]
[37,{"$f":"IF(Definitioner!B39<>\"\",Definitioner!B39,\"\")","v":"Petroleum (C9-C16) (Reflab4)"}]
[39,{"$f":"IF(Definitioner!B40<>\"\",Definitioner!B40,\"\")","v":"Molybdæn"}]
[40,{"$f":"IF(Definitioner!B41<>\"\",Definitioner!B41,\"\")","v":"MTBE"}]
[41,{"$f":"IF(Definitioner!B42<>\"\",Definitioner!B42,\"\")","v":"Trichlorethylen"}]
[42,{"$f":"IF(Definitioner!B43<>\"\",Definitioner!B43,\"\")","v":"Tetrachlorethylen"}]
[43,{"$f":"IF(Definitioner!B44<>\"\",Definitioner!B44,\"\")","v":"Tetrachlormethan"}]
[44,{"$f":"IF(Definitioner!B45<>\"\",Definitioner!B45,\"\")","v":"Toluen"}]
[45,{"$f":"IF(Definitioner!B46<>\"\",Definitioner!B46,\"\")","v":"Ethylbenzen"}]
[46,{"$f":"IF(Definitioner!B47<>\"\",Definitioner!B47,\"\")","v":"o-Xylen"}]
[47,{"$f":"IF(Definitioner!B48<>\"\",Definitioner!B48,\"\")","v":"m+p-Xylen"}]
[48,{"$f":"IF(Definitioner!B49<>\"\",Definitioner!B49,\"\")","v":"C20-C35 (Reflab1)"},300]
[49,{"$f":"IF(Definitioner!B50<>\"\",Definitioner!B50,\"\")","v":"C15-C20 (Reflab1)"}]
[50,{"$f":"IF(Definitioner!B51<>\"\",Definitioner!B51,\"\")","v":"C10-C15 (Reflab1)"}]
[51,{"$f":"IF(Definitioner!B52<>\"\",Definitioner!B52,\"\")","v":"Sum C10-C20 (Reflab4)"},100]
[52,{"$f":"IF(Definitioner!B53<>\"\",Definitioner!B53,\"\")","v":"Sum C10-C20 (Reflab1)"},100]
[53,{"$f":"IF(Definitioner!B54<>\"\",Definitioner!B54,\"\")","v":"Vinylchlorid"}]
[54,{"$f":"IF(Definitioner!B55<>\"\",Definitioner!B55,\"\")","v":"1,1-dichlorethylen"}]
[55,{"$f":"IF(Definitioner!B56<>\"\",Definitioner!B56,\"\")","v":"trans-1,2-dichlorethylen"}]
[56,{"$f":"IF(Definitioner!B57<>\"\",Definitioner!B57,\"\")","v":"1,1-dichlorethan"}]
[57,{"$f":"IF(Definitioner!B58<>\"\",Definitioner!B58,\"\")","v":"cis-1,2-dichlorethylen"}]
[58,{"$f":"IF(Definitioner!B59<>\"\",Definitioner!B59,\"\")","v":"Dichlormethan"}]
[59,{"$f":"IF(Definitioner!B60<>\"\",Definitioner!B60,\"\")","v":"1,1,2-trichlorethan"}]
[60,{"$f":"IF(Definitioner!B61<>\"\",Definitioner!B61,\"\")","v":"1,2-dichlorethan"}]
[61,{"$f":"IF(Definitioner!B62<>\"\",Definitioner!B62,\"\")","v":"1,2-dibromethan"}]
[62,{"$f":"IF(Definitioner!B63<>\"\",Definitioner!B63,\"\")","v":"Chlorbenzen"}]
[63,{"$f":"IF(Definitioner!B64<>\"\",Definitioner!B64,\"\")","v":"1,2-dichlorbenzen"}]
[64,{"$f":"IF(Definitioner!B65<>\"\",Definitioner!B65,\"\")","v":"1,4-dichlorbenzen"}]
[65,{"$f":"IF(Definitioner!B66<>\"\",Definitioner!B66,\"\")","v":"Chlorethan"}]
[66,{"$f":"IF(Definitioner!B67<>\"\",Definitioner!B67,\"\")","v":"TBA (tert-butyl-alkohol)"}]
[67,{"$f":"IF(Definitioner!B68<>\"\",Definitioner!B68,\"\")","v":"methanol"}]
[68,{"$f":"IF(Definitioner!B69<>\"\",Definitioner!B69,\"\")","v":"Ethanol"}]
[69,{"$f":"IF(Definitioner!B70<>\"\",Definitioner!B70,\"\")","v":"diethylether"}]
[70,{"$f":"IF(Definitioner!B71<>\"\",Definitioner!B71,\"\")","v":"acetone"}]
[71,{"$f":"IF(Definitioner!B72<>\"\",Definitioner!B72,\"\")","v":"isopropanol"}]
[72,{"$f":"IF(Definitioner!B73<>\"\",Definitioner!B73,\"\")","v":"1-propanol"}]
[73,{"$f":"IF(Definitioner!B74<>\"\",Definitioner!B74,\"\")","v":"diisopropylether"}]
[74,{"$f":"IF(Definitioner!B75<>\"\",Definitioner!B75,\"\")","v":"MEK"}]
[75,{"$f":"IF(Definitioner!B76<>\"\",Definitioner!B76,\"\")","v":"ethylacetat"}]
[76,{"$f":"IF(Definitioner!B77<>\"\",Definitioner!B77,\"\")","v":"methylacrylat"}]
[77,{"$f":"IF(Definitioner!B78<>\"\",Definitioner!B78,\"\")","v":"isobutanol"}]
[78,{"$f":"IF(Definitioner!B79<>\"\",Definitioner!B79,\"\")","v":"isopropylacetat"}]
[79,{"$f":"IF(Definitioner!B80<>\"\",Definitioner!B80,\"\")","v":"1-butanol"}]
[80,{"$f":"IF(Definitioner!B81<>\"\",Definitioner!B81,\"\")","v":"methylmetacrylat"}]
[81,{"$f":"IF(Definitioner!B82<>\"\",Definitioner!B82,\"\")","v":"MIBK"}]
[82,{"$f":"IF(Definitioner!B83<>\"\",Definitioner!B83,\"\")","v":"isobutylacetat"}]
[83,{"$f":"IF(Definitioner!B84<>\"\",Definitioner!B84,\"\")","v":"butylacetat"}]
[84,{"$f":"IF(Definitioner!B85<>\"\",Definitioner!B85,\"\")","v":"Vinylacetat"}]
[85,{"$f":"IF(Definitioner!B86<>\"\",Definitioner!B86,\"\")","v":"Acetaldehyd"}]
[86,{"$f":"IF(Definitioner!B87<>\"\",Definitioner!B87,\"\")","v":"Sum af xylener"}]
[87,{"$f":"IF(Definitioner!B88<>\"\",Definitioner!B88,\"\")","v":"Svovl, total"}]
[88,{"$f":"IF(Definitioner!B89<>\"\",Definitioner!B89,\"\")","v":"Chloroform"}]
[89,{"$f":"IF(Definitioner!B90<>\"\",Definitioner!B90,\"\")","v":"1,1,1-trichlorethan"}]
[90,{"$f":"IF(Definitioner!B91<>\"\",Definitioner!B91,\"\")","v":"Cyanid, total"}]
[91,{"$f":"IF(Definitioner!B92<>\"\",Definitioner!B92,\"\")","v":"Pentachlorphenol"}]
[92,{"$f":"IF(Definitioner!B93<>\"\",Definitioner!B93,\"\")","v":"Barium"}]
[93,{"$f":"IF(Definitioner!B94<>\"\",Definitioner!B94,\"\")","v":"PCB(total)*5"}]
[94,{"$f":"IF(Definitioner!B95<>\"\",Definitioner!B95,\"\")","v":"Chlorparaffiner C10-C13"}]
[95,{"$f":"IF(Definitioner!B96<>\"\",Definitioner!B96,\"\")","v":"Chlorparaffiner C14-C17"}]
[96,{"$f":"IF(Definitioner!B97<>\"\",Definitioner!B97,\"\")","v":"Asbest"}]
[97,{"$f":"IF(Definitioner!B98<>\"\",Definitioner!B98,\"\")","v":"Aquatic Acute 1(H400)"}]
[98,{"$f":"IF(Definitioner!B99<>\"\",Definitioner!B99,\"\")","v":"Aquatic Chronic 1 (H410)"}]
[99,{"$f":"IF(Definitioner!B100<>\"\",Definitioner!B100,\"\")","v":"Tørstof"}]

{"sheet":"9","index":16,"n_rows":102,"n_cols":6,"rows_kept":102,"cut":false,"hidden":true,"merged":[]}
["Klintholm I/S"]
[null,null,"<=","<=","<=",">"]
["Parameter ID","Parameter","Kategori 1","Kategori 2","Udenfor Kat.","Farlig Affald"]
[0,{"$f":"IF(Definitioner!B2<>\"\",Definitioner!B2,\"\")","v":"Dybde"}]
[1,{"$f":"IF(Definitioner!B3<>\"\",Definitioner!B3,\"\")","v":"Arsen"},20,20,1000,1000]
[2,{"$f":"IF(Definitioner!B4<>\"\",Definitioner!B4,\"\")","v":"Bly "},40,400,2500,2500]
[3,{"$f":"IF(Definitioner!B5<>\"\",Definitioner!B5,\"\")","v":"Cadmium"},0.5,5,1000,1000]
[4,{"$f":"IF(Definitioner!B6<>\"\",Definitioner!B6,\"\")","v":"Chrom VI"},20,20,1000,1000]
[5,{"$f":"IF(Definitioner!B7<>\"\",Definitioner!B7,\"\")","v":"Chrom total"},500,1000,1000,1000]
[6,{"$f":"IF(Definitioner!B8<>\"\",Definitioner!B8,\"\")","v":"Kobber "},500,1000,2500,2500]
[7,{"$f":"IF(Definitioner!B9<>\"\",Definitioner!B9,\"\")","v":"Kviksølv"},1,3,500,500]
[8,{"$f":"IF(Definitioner!B10<>\"\",Definitioner!B10,\"\")","v":"Nikkel"},30,40,1000,1000]
[9,{"$f":"IF(Definitioner!B11<>\"\",Definitioner!B11,\"\")","v":"Tin"}]
[10,{"$f":"IF(Definitioner!B12<>\"\",Definitioner!B12,\"\")","v":"Zink"},500,1000,2500,2500]
[11,{"$f":"IF(Definitioner!B13<>\"\",Definitioner!B13,\"\")","v":"Sum C6-C35 (Reflab1)"},100,300,1000000]
[12,{"$f":"IF(Definitioner!B14<>\"\",Definitioner!B14,\"\")","v":"C6-C10 (Reflab1)"},25,null,null,25]
[13,{"$f":"IF(Definitioner!B15<>\"\",Definitioner!B15,\"\")","v":"C10-C25 (Reflab1 gl.)"},100,100,1000000]
[14,{"$f":"IF(Definitioner!B16<>\"\",Definitioner!B16,\"\")","v":"C25-C35 (Reflab1 gl.)"},100,300,1000000]
[15,{"$f":"IF(Definitioner!B17<>\"\",Definitioner!B17,\"\")","v":"BTEX, sum"},0.6,10,10,10]
[16,{"$f":"IF(Definitioner!B18<>\"\",Definitioner!B18,\"\")","v":"Benzen"},1.5,1.5,1000,1000]
[17,{"$f":"IF(Definitioner!B19<>\"\",Definitioner!B19,\"\")","v":"Naphtalen"},0.3,1.5,2500,2500]
[18,{"$f":"IF(Definitioner!B20<>\"\",Definitioner!B20,\"\")","v":"Sum af 7 PAH'er"},4,40,40,40]
[19,{"$f":"IF(Definitioner!B21<>\"\",Definitioner!B21,\"\")","v":"Benz(a)pyren"},0.3,3,100,100]
[20,{"$f":"IF(Definitioner!B22<>\"\",Definitioner!B22,\"\")","v":"Dibenz(a,h)anthracen"},0.3,3,25,25]
[21,{"$f":"IF(Definitioner!B23<>\"\",Definitioner!B23,\"\")","v":"Phenoler, sum"},0.1,10,10,10]
[22,{"$f":"IF(Definitioner!B24<>\"\",Definitioner!B24,\"\")","v":"Cyanid, total"},500000,500000,1000000,1000000]
[23,{"$f":"IF(Definitioner!B25<>\"\",Definitioner!B25,\"\")","v":"Cyanid, syreflygtig"},10000,10000,10000]
[24,{"$f":"IF(Definitioner!B26<>\"\",Definitioner!B26,\"\")","v":"Fluoranthen"}]
[25,{"$f":"IF(Definitioner!B27<>\"\",Definitioner!B27,\"\")","v":"Benz(b+j+k)fluoranthen"}]
[26,{"$f":"IF(Definitioner!B28<>\"\",Definitioner!B28,\"\")","v":"Indeno(1,2,3-cd)pyren"}]
[27,{"$f":"IF(Definitioner!B29<>\"\",Definitioner!B29,\"\")","v":"Chrom (bortset fra VI)"}]
[28,{"$f":"IF(Definitioner!B30<>\"\",Definitioner!B30,\"\")","v":"Sum C6-C40 (Reflab4)"}]
[29,{"$f":"IF(Definitioner!B31<>\"\",Definitioner!B31,\"\")","v":"C6-C10 (Reflab4)"}]
[30,{"$f":"IF(Definitioner!B32<>\"\",Definitioner!B32,\"\")","v":"C10-C20 (Reflab4)"}]
[31,{"$f":"IF(Definitioner!B33<>\"\",Definitioner!B33,\"\")","v":"C10-C15 (Reflab4)"}]
[32,{"$f":"IF(Definitioner!B34<>\"\",Definitioner!B34,\"\")","v":"C15-C20 (Reflab4)"}]
[33,{"$f":"IF(Definitioner!B35<>\"\",Definitioner!B35,\"\")","v":"C20-C40 (Reflab4)"}]
[34,{"$f":"IF(Definitioner!B36<>\"\",Definitioner!B36,\"\")","v":"Terpentin (C7-C12) (Reflab1)"}]
[35,{"$f":"IF(Definitioner!B37<>\"\",Definitioner!B37,\"\")","v":"Petroleum (C9-C16) (Reflab1)"}]
[36,{"$f":"IF(Definitioner!B38<>\"\",Definitioner!B38,\"\")","v":"Terpentin (C7-C12) (Reflab4)"}]
[37,{"$f":"IF(Definitioner!B39<>\"\",Definitioner!B39,\"\")","v":"Petroleum (C9-C16) (Reflab4)"}]
[39,{"$f":"IF(Definitioner!B40<>\"\",Definitioner!B40,\"\")","v":"Molybdæn"}]
[40,{"$f":"IF(Definitioner!B41<>\"\",Definitioner!B41,\"\")","v":"MTBE"}]
[41,{"$f":"IF(Definitioner!B42<>\"\",Definitioner!B42,\"\")","v":"Trichlorethylen"}]
[42,{"$f":"IF(Definitioner!B43<>\"\",Definitioner!B43,\"\")","v":"Tetrachlorethylen"}]
[43,{"$f":"IF(Definitioner!B44<>\"\",Definitioner!B44,\"\")","v":"Tetrachlormethan"}]
[44,{"$f":"IF(Definitioner!B45<>\"\",Definitioner!B45,\"\")","v":"Toluen"},null,null,null,50000]
[45,{"$f":"IF(Definitioner!B46<>\"\",Definitioner!B46,\"\")","v":"Ethylbenzen"}]
[46,{"$f":"IF(Definitioner!B47<>\"\",Definitioner!B47,\"\")","v":"o-Xylen"}]
[47,{"$f":"IF(Definitioner!B48<>\"\",Definitioner!B48,\"\")","v":"m+p-Xylen"}]
[48,{"$f":"IF(Definitioner!B49<>\"\",Definitioner!B49,\"\")","v":"C20-C35 (Reflab1)"},100,300,1000000]
[49,{"$f":"IF(Definitioner!B50<>\"\",Definitioner!B50,\"\")","v":"C15-C20 (Reflab1)"},55,55,55]
[50,{"$f":"IF(Definitioner!B51<>\"\",Definitioner!B51,\"\")","v":"C10-C15 (Reflab1)"},40,40,40]
[51,{"$f":"IF(Definitioner!B52<>\"\",Definitioner!B52,\"\")","v":"Sum C10-C20 (Reflab4)"}]
[52,{"$f":"IF(Definitioner!B53<>\"\",Definitioner!B53,\"\")","v":"Sum C10-C20 (Reflab1)"}]
[53,{"$f":"IF(Definitioner!B54<>\"\",Definitioner!B54,\"\")","v":"Vinylchlorid"}]
[54,{"$f":"IF(Definitioner!B55<>\"\",Definitioner!B55,\"\")","v":"1,1-dichlorethylen"}]
[55,{"$f":"IF(Definitioner!B56<>\"\",Definitioner!B56,\"\")","v":"trans-1,2-dichlorethylen"}]
[56,{"$f":"IF(Definitioner!B57<>\"\",Definitioner!B57,\"\")","v":"1,1-dichlorethan"}]
[57,{"$f":"IF(Definitioner!B58<>\"\",Definitioner!B58,\"\")","v":"cis-1,2-dichlorethylen"}]
[58,{"$f":"IF(Definitioner!B59<>\"\",Definitioner!B59,\"\")","v":"Dichlormethan"}]
[59,{"$f":"IF(Definitioner!B60<>\"\",Definitioner!B60,\"\")","v":"1,1,2-trichlorethan"}]
[60,{"$f":"IF(Definitioner!B61<>\"\",Definitioner!B61,\"\")","v":"1,2-dichlorethan"}]
[61,{"$f":"IF(Definitioner!B62<>\"\",Definitioner!B62,\"\")","v":"1,2-dibromethan"}]
[62,{"$f":"IF(Definitioner!B63<>\"\",Definitioner!B63,\"\")","v":"Chlorbenzen"}]
[63,{"$f":"IF(Definitioner!B64<>\"\",Definitioner!B64,\"\")","v":"1,2-dichlorbenzen"}]
[64,{"$f":"IF(Definitioner!B65<>\"\",Definitioner!B65,\"\")","v":"1,4-dichlorbenzen"}]
[65,{"$f":"IF(Definitioner!B66<>\"\",Definitioner!B66,\"\")","v":"Chlorethan"}]
[66,{"$f":"IF(Definitioner!B67<>\"\",Definitioner!B67,\"\")","v":"TBA (tert-butyl-alkohol)"}]
[67,{"$f":"IF(Definitioner!B68<>\"\",Definitioner!B68,\"\")","v":"methanol"}]
[68,{"$f":"IF(Definitioner!B69<>\"\",Definitioner!B69,\"\")","v":"Ethanol"}]
[69,{"$f":"IF(Definitioner!B70<>\"\",Definitioner!B70,\"\")","v":"diethylether"}]
[70,{"$f":"IF(Definitioner!B71<>\"\",Definitioner!B71,\"\")","v":"acetone"}]
[71,{"$f":"IF(Definitioner!B72<>\"\",Definitioner!B72,\"\")","v":"isopropanol"}]
[72,{"$f":"IF(Definitioner!B73<>\"\",Definitioner!B73,\"\")","v":"1-propanol"}]
[73,{"$f":"IF(Definitioner!B74<>\"\",Definitioner!B74,\"\")","v":"diisopropylether"}]
[74,{"$f":"IF(Definitioner!B75<>\"\",Definitioner!B75,\"\")","v":"MEK"}]
[75,{"$f":"IF(Definitioner!B76<>\"\",Definitioner!B76,\"\")","v":"ethylacetat"}]
[76,{"$f":"IF(Definitioner!B77<>\"\",Definitioner!B77,\"\")","v":"methylacrylat"}]
[77,{"$f":"IF(Definitioner!B78<>\"\",Definitioner!B78,\"\")","v":"isobutanol"}]
[78,{"$f":"IF(Definitioner!B79<>\"\",Definitioner!B79,\"\")","v":"isopropylacetat"}]
[79,{"$f":"IF(Definitioner!B80<>\"\",Definitioner!B80,\"\")","v":"1-butanol"}]
[80,{"$f":"IF(Definitioner!B81<>\"\",Definitioner!B81,\"\")","v":"methylmetacrylat"}]
[81,{"$f":"IF(Definitioner!B82<>\"\",Definitioner!B82,\"\")","v":"MIBK"}]
[82,{"$f":"IF(Definitioner!B83<>\"\",Definitioner!B83,\"\")","v":"isobutylacetat"}]
[83,{"$f":"IF(Definitioner!B84<>\"\",Definitioner!B84,\"\")","v":"butylacetat"}]
[84,{"$f":"IF(Definitioner!B85<>\"\",Definitioner!B85,\"\")","v":"Vinylacetat"}]
[85,{"$f":"IF(Definitioner!B86<>\"\",Definitioner!B86,\"\")","v":"Acetaldehyd"}]
[86,{"$f":"IF(Definitioner!B87<>\"\",Definitioner!B87,\"\")","v":"Sum af xylener"}]
[87,{"$f":"IF(Definitioner!B88<>\"\",Definitioner!B88,\"\")","v":"Svovl, total"}]
[88,{"$f":"IF(Definitioner!B89<>\"\",Definitioner!B89,\"\")","v":"Chloroform"}]
[89,{"$f":"IF(Definitioner!B90<>\"\",Definitioner!B90,\"\")","v":"1,1,1-trichlorethan"}]
[90,{"$f":"IF(Definitioner!B91<>\"\",Definitioner!B91,\"\")","v":"Cyanid, total"},50,500,500]
[91,{"$f":"IF(Definitioner!B92<>\"\",Definitioner!B92,\"\")","v":"Pentachlorphenol"},5,5,1000000,1000000]
[92,"Barium",100,null,null,100]
[93,{"$f":"IF(Definitioner!B94<>\"\",Definitioner!B94,\"\")","v":"PCB(total)*5"}]
[94,{"$f":"IF(Definitioner!B95<>\"\",Definitioner!B95,\"\")","v":"Chlorparaffiner C10-C13"}]
[95,{"$f":"IF(Definitioner!B96<>\"\",Definitioner!B96,\"\")","v":"Chlorparaffiner C14-C17"}]
[96,{"$f":"IF(Definitioner!B97<>\"\",Definitioner!B97,\"\")","v":"Asbest"}]
[97,{"$f":"IF(Definitioner!B98<>\"\",Definitioner!B98,\"\")","v":"Aquatic Acute 1(H400)"}]
[98,{"$f":"IF(Definitioner!B99<>\"\",Definitioner!B99,\"\")","v":"Aquatic Chronic 1 (H410)"}]
[99,{"$f":"IF(Definitioner!B100<>\"\",Definitioner!B100,\"\")","v":"Tørstof"}]

{"sheet":"10","index":17,"n_rows":102,"n_cols":5,"rows_kept":102,"cut":false,"hidden":true,"merged":[]}
["Vejledning Nordjyllands Amt"]
[null,null,"<","<=",">"]
["Parameter ID","Parameter","Klasse 0","Klasse 1","Klasse 2"]
[0,{"$f":"IF(Definitioner!B2<>\"\",Definitioner!B2,\"\")","v":"Dybde"}]
[1,{"$f":"IF(Definitioner!B3<>\"\",Definitioner!B3,\"\")","v":"Arsen"},20,50,50]
[2,{"$f":"IF(Definitioner!B4<>\"\",Definitioner!B4,\"\")","v":"Bly "},40,400,400]
[3,{"$f":"IF(Definitioner!B5<>\"\",Definitioner!B5,\"\")","v":"Cadmium"},0.5,5,5]
[4,{"$f":"IF(Definitioner!B6<>\"\",Definitioner!B6,\"\")","v":"Chrom VI"},20,50,50]
[5,{"$f":"IF(Definitioner!B7<>\"\",Definitioner!B7,\"\")","v":"Chrom total"},500,1000,1000]
[6,{"$f":"IF(Definitioner!B8<>\"\",Definitioner!B8,\"\")","v":"Kobber "},500,1000,1000]
[7,{"$f":"IF(Definitioner!B9<>\"\",Definitioner!B9,\"\")","v":"Kviksølv"},1,3,3]
[8,{"$f":"IF(Definitioner!B10<>\"\",Definitioner!B10,\"\")","v":"Nikkel"},30,75,75]
[9,{"$f":"IF(Definitioner!B11<>\"\",Definitioner!B11,\"\")","v":"Tin"}]
[10,{"$f":"IF(Definitioner!B12<>\"\",Definitioner!B12,\"\")","v":"Zink"},500,1000,1000]
[11,{"$f":"IF(Definitioner!B13<>\"\",Definitioner!B13,\"\")","v":"Sum C6-C35 (Reflab1)"},100,500,500]
[12,{"$f":"IF(Definitioner!B14<>\"\",Definitioner!B14,\"\")","v":"C6-C10 (Reflab1)"},25,50,50]
[13,{"$f":"IF(Definitioner!B15<>\"\",Definitioner!B15,\"\")","v":"C10-C25 (Reflab1 gl.)"},100,500,500]
[14,{"$f":"IF(Definitioner!B16<>\"\",Definitioner!B16,\"\")","v":"C25-C35 (Reflab1 gl.)"},100,500,500]
[15,{"$f":"IF(Definitioner!B17<>\"\",Definitioner!B17,\"\")","v":"BTEX, sum"},10,20,20]
[16,{"$f":"IF(Definitioner!B18<>\"\",Definitioner!B18,\"\")","v":"Benzen"},1.5,2.5,2.5]
[17,{"$f":"IF(Definitioner!B19<>\"\",Definitioner!B19,\"\")","v":"Naphtalen"}]
[18,{"$f":"IF(Definitioner!B20<>\"\",Definitioner!B20,\"\")","v":"Sum af 7 PAH'er"},1.5,15,15]
[19,{"$f":"IF(Definitioner!B21<>\"\",Definitioner!B21,\"\")","v":"Benz(a)pyren"},0.1,1,1]
[20,{"$f":"IF(Definitioner!B22<>\"\",Definitioner!B22,\"\")","v":"Dibenz(a,h)anthracen"},0.1,1,1]
[21,{"$f":"IF(Definitioner!B23<>\"\",Definitioner!B23,\"\")","v":"Phenoler, sum"}]
[22,{"$f":"IF(Definitioner!B24<>\"\",Definitioner!B24,\"\")","v":"Cyanid, total"},500000,1000000,1000000]
[23,{"$f":"IF(Definitioner!B25<>\"\",Definitioner!B25,\"\")","v":"Cyanid, syreflygtig"},10000,100000,100000]
[24,{"$f":"IF(Definitioner!B26<>\"\",Definitioner!B26,\"\")","v":"Fluoranthen"}]
[25,{"$f":"IF(Definitioner!B27<>\"\",Definitioner!B27,\"\")","v":"Benz(b+j+k)fluoranthen"}]
[26,{"$f":"IF(Definitioner!B28<>\"\",Definitioner!B28,\"\")","v":"Indeno(1,2,3-cd)pyren"}]
[27,{"$f":"IF(Definitioner!B29<>\"\",Definitioner!B29,\"\")","v":"Chrom (bortset fra VI)"}]
[28,{"$f":"IF(Definitioner!B30<>\"\",Definitioner!B30,\"\")","v":"Sum C6-C40 (Reflab4)"}]
[29,{"$f":"IF(Definitioner!B31<>\"\",Definitioner!B31,\"\")","v":"C6-C10 (Reflab4)"}]
[30,{"$f":"IF(Definitioner!B32<>\"\",Definitioner!B32,\"\")","v":"C10-C20 (Reflab4)"}]
[31,{"$f":"IF(Definitioner!B33<>\"\",Definitioner!B33,\"\")","v":"C10-C15 (Reflab4)"}]
[32,{"$f":"IF(Definitioner!B34<>\"\",Definitioner!B34,\"\")","v":"C15-C20 (Reflab4)"}]
[33,{"$f":"IF(Definitioner!B35<>\"\",Definitioner!B35,\"\")","v":"C20-C40 (Reflab4)"}]
[34,{"$f":"IF(Definitioner!B36<>\"\",Definitioner!B36,\"\")","v":"Terpentin (C7-C12) (Reflab1)"},25,50,50]
[35,{"$f":"IF(Definitioner!B37<>\"\",Definitioner!B37,\"\")","v":"Petroleum (C9-C16) (Reflab1)"},25,50,50]
[36,{"$f":"IF(Definitioner!B38<>\"\",Definitioner!B38,\"\")","v":"Terpentin (C7-C12) (Reflab4)"}]
[37,{"$f":"IF(Definitioner!B39<>\"\",Definitioner!B39,\"\")","v":"Petroleum (C9-C16) (Reflab4)"}]
[39,{"$f":"IF(Definitioner!B40<>\"\",Definitioner!B40,\"\")","v":"Molybdæn"}]
[40,{"$f":"IF(Definitioner!B41<>\"\",Definitioner!B41,\"\")","v":"MTBE"}]
[41,{"$f":"IF(Definitioner!B42<>\"\",Definitioner!B42,\"\")","v":"Trichlorethylen"}]
[42,{"$f":"IF(Definitioner!B43<>\"\",Definitioner!B43,\"\")","v":"Tetrachlorethylen"}]
[43,{"$f":"IF(Definitioner!B44<>\"\",Definitioner!B44,\"\")","v":"Tetrachlormethan"}]
[44,{"$f":"IF(Definitioner!B45<>\"\",Definitioner!B45,\"\")","v":"Toluen"}]
[45,{"$f":"IF(Definitioner!B46<>\"\",Definitioner!B46,\"\")","v":"Ethylbenzen"}]
[46,{"$f":"IF(Definitioner!B47<>\"\",Definitioner!B47,\"\")","v":"o-Xylen"}]
[47,{"$f":"IF(Definitioner!B48<>\"\",Definitioner!B48,\"\")","v":"m+p-Xylen"}]
[48,{"$f":"IF(Definitioner!B49<>\"\",Definitioner!B49,\"\")","v":"C20-C35 (Reflab1)"}]
[49,{"$f":"IF(Definitioner!B50<>\"\",Definitioner!B50,\"\")","v":"C15-C20 (Reflab1)"}]
[50,{"$f":"IF(Definitioner!B51<>\"\",Definitioner!B51,\"\")","v":"C10-C15 (Reflab1)"}]
[51,{"$f":"IF(Definitioner!B52<>\"\",Definitioner!B52,\"\")","v":"Sum C10-C20 (Reflab4)"}]
[52,{"$f":"IF(Definitioner!B53<>\"\",Definitioner!B53,\"\")","v":"Sum C10-C20 (Reflab1)"}]
[53,{"$f":"IF(Definitioner!B54<>\"\",Definitioner!B54,\"\")","v":"Vinylchlorid"}]
[54,{"$f":"IF(Definitioner!B55<>\"\",Definitioner!B55,\"\")","v":"1,1-dichlorethylen"}]
[55,{"$f":"IF(Definitioner!B56<>\"\",Definitioner!B56,\"\")","v":"trans-1,2-dichlorethylen"}]
[56,{"$f":"IF(Definitioner!B57<>\"\",Definitioner!B57,\"\")","v":"1,1-dichlorethan"}]
[57,{"$f":"IF(Definitioner!B58<>\"\",Definitioner!B58,\"\")","v":"cis-1,2-dichlorethylen"}]
[58,{"$f":"IF(Definitioner!B59<>\"\",Definitioner!B59,\"\")","v":"Dichlormethan"}]
[59,{"$f":"IF(Definitioner!B60<>\"\",Definitioner!B60,\"\")","v":"1,1,2-trichlorethan"}]
[60,{"$f":"IF(Definitioner!B61<>\"\",Definitioner!B61,\"\")","v":"1,2-dichlorethan"}]
[61,{"$f":"IF(Definitioner!B62<>\"\",Definitioner!B62,\"\")","v":"1,2-dibromethan"}]
[62,{"$f":"IF(Definitioner!B63<>\"\",Definitioner!B63,\"\")","v":"Chlorbenzen"}]
[63,{"$f":"IF(Definitioner!B64<>\"\",Definitioner!B64,\"\")","v":"1,2-dichlorbenzen"}]
[64,{"$f":"IF(Definitioner!B65<>\"\",Definitioner!B65,\"\")","v":"1,4-dichlorbenzen"}]
[65,{"$f":"IF(Definitioner!B66<>\"\",Definitioner!B66,\"\")","v":"Chlorethan"}]
[66,{"$f":"IF(Definitioner!B67<>\"\",Definitioner!B67,\"\")","v":"TBA (tert-butyl-alkohol)"}]
[67,{"$f":"IF(Definitioner!B68<>\"\",Definitioner!B68,\"\")","v":"methanol"}]
[68,{"$f":"IF(Definitioner!B69<>\"\",Definitioner!B69,\"\")","v":"Ethanol"}]
[69,{"$f":"IF(Definitioner!B70<>\"\",Definitioner!B70,\"\")","v":"diethylether"}]
[70,{"$f":"IF(Definitioner!B71<>\"\",Definitioner!B71,\"\")","v":"acetone"}]
[71,{"$f":"IF(Definitioner!B72<>\"\",Definitioner!B72,\"\")","v":"isopropanol"}]
[72,{"$f":"IF(Definitioner!B73<>\"\",Definitioner!B73,\"\")","v":"1-propanol"}]
[73,{"$f":"IF(Definitioner!B74<>\"\",Definitioner!B74,\"\")","v":"diisopropylether"}]
[74,{"$f":"IF(Definitioner!B75<>\"\",Definitioner!B75,\"\")","v":"MEK"}]
[75,{"$f":"IF(Definitioner!B76<>\"\",Definitioner!B76,\"\")","v":"ethylacetat"}]
[76,{"$f":"IF(Definitioner!B77<>\"\",Definitioner!B77,\"\")","v":"methylacrylat"}]
[77,{"$f":"IF(Definitioner!B78<>\"\",Definitioner!B78,\"\")","v":"isobutanol"}]
[78,{"$f":"IF(Definitioner!B79<>\"\",Definitioner!B79,\"\")","v":"isopropylacetat"}]
[79,{"$f":"IF(Definitioner!B80<>\"\",Definitioner!B80,\"\")","v":"1-butanol"}]
[80,{"$f":"IF(Definitioner!B81<>\"\",Definitioner!B81,\"\")","v":"methylmetacrylat"}]
[81,{"$f":"IF(Definitioner!B82<>\"\",Definitioner!B82,\"\")","v":"MIBK"}]
[82,{"$f":"IF(Definitioner!B83<>\"\",Definitioner!B83,\"\")","v":"isobutylacetat"}]
[83,{"$f":"IF(Definitioner!B84<>\"\",Definitioner!B84,\"\")","v":"butylacetat"}]
[84,{"$f":"IF(Definitioner!B85<>\"\",Definitioner!B85,\"\")","v":"Vinylacetat"}]
[85,{"$f":"IF(Definitioner!B86<>\"\",Definitioner!B86,\"\")","v":"Acetaldehyd"}]
[86,{"$f":"IF(Definitioner!B87<>\"\",Definitioner!B87,\"\")","v":"Sum af xylener"}]
[87,{"$f":"IF(Definitioner!B88<>\"\",Definitioner!B88,\"\")","v":"Svovl, total"}]
[88,{"$f":"IF(Definitioner!B89<>\"\",Definitioner!B89,\"\")","v":"Chloroform"}]
[89,{"$f":"IF(Definitioner!B90<>\"\",Definitioner!B90,\"\")","v":"1,1,1-trichlorethan"}]
[90,{"$f":"IF(Definitioner!B91<>\"\",Definitioner!B91,\"\")","v":"Cyanid, total"}]
[91,{"$f":"IF(Definitioner!B92<>\"\",Definitioner!B92,\"\")","v":"Pentachlorphenol"}]
[92,{"$f":"IF(Definitioner!B93<>\"\",Definitioner!B93,\"\")","v":"Barium"}]
[93,{"$f":"IF(Definitioner!B94<>\"\",Definitioner!B94,\"\")","v":"PCB(total)*5"}]
[94,{"$f":"IF(Definitioner!B95<>\"\",Definitioner!B95,\"\")","v":"Chlorparaffiner C10-C13"}]
[95,{"$f":"IF(Definitioner!B96<>\"\",Definitioner!B96,\"\")","v":"Chlorparaffiner C14-C17"}]
[96,{"$f":"IF(Definitioner!B97<>\"\",Definitioner!B97,\"\")","v":"Asbest"}]
[97,{"$f":"IF(Definitioner!B98<>\"\",Definitioner!B98,\"\")","v":"Aquatic Acute 1(H400)"}]
[98,{"$f":"IF(Definitioner!B99<>\"\",Definitioner!B99,\"\")","v":"Aquatic Chronic 1 (H410)"}]
[99,{"$f":"IF(Definitioner!B100<>\"\",Definitioner!B100,\"\")","v":"Tørstof"}]

{"sheet":"3","index":18,"n_rows":102,"n_cols":5,"rows_kept":102,"cut":false,"hidden":true,"merged":[]}
["Bekendtgørelse nr.1452+554",null,"(Jordflytningsbekendtgørelsen)"]
[null,null,"<=","<=",">"]
["Parameter ID","Parameter","Kategori 1","Kategori 2","Udenfor Kat."]
[0,{"$f":"IF(Definitioner!B2<>\"\",Definitioner!B2,\"\")","v":"Dybde"}]
[1,{"$f":"IF(Definitioner!B3<>\"\",Definitioner!B3,\"\")","v":"Arsen"},20,20,20]
[2,{"$f":"IF(Definitioner!B4<>\"\",Definitioner!B4,\"\")","v":"Bly "},40,400,400]
[3,{"$f":"IF(Definitioner!B5<>\"\",Definitioner!B5,\"\")","v":"Cadmium"},0.5,5,5]
[4,{"$f":"IF(Definitioner!B6<>\"\",Definitioner!B6,\"\")","v":"Chrom VI"}]
[5,{"$f":"IF(Definitioner!B7<>\"\",Definitioner!B7,\"\")","v":"Chrom total"},500,1000,1000]
[6,{"$f":"IF(Definitioner!B8<>\"\",Definitioner!B8,\"\")","v":"Kobber "},500,1000,1000]
[7,{"$f":"IF(Definitioner!B9<>\"\",Definitioner!B9,\"\")","v":"Kviksølv"},1,3,3]
[8,{"$f":"IF(Definitioner!B10<>\"\",Definitioner!B10,\"\")","v":"Nikkel"}]
[9,{"$f":"IF(Definitioner!B11<>\"\",Definitioner!B11,\"\")","v":"Tin"}]
[10,{"$f":"IF(Definitioner!B12<>\"\",Definitioner!B12,\"\")","v":"Zink"},500,1000,1000]
[11,{"$f":"IF(Definitioner!B13<>\"\",Definitioner!B13,\"\")","v":"Sum C6-C35 (Reflab1)"},100,300,300]
[12,{"$f":"IF(Definitioner!B14<>\"\",Definitioner!B14,\"\")","v":"C6-C10 (Reflab1)"},25,25,25]
[13,{"$f":"IF(Definitioner!B15<>\"\",Definitioner!B15,\"\")","v":"C10-C25 (Reflab1 gl.)"}]
[14,{"$f":"IF(Definitioner!B16<>\"\",Definitioner!B16,\"\")","v":"C25-C35 (Reflab1 gl.)"}]
[15,{"$f":"IF(Definitioner!B17<>\"\",Definitioner!B17,\"\")","v":"BTEX, sum"}]
[16,{"$f":"IF(Definitioner!B18<>\"\",Definitioner!B18,\"\")","v":"Benzen"}]
[17,{"$f":"IF(Definitioner!B19<>\"\",Definitioner!B19,\"\")","v":"Naphtalen"}]
[18,{"$f":"IF(Definitioner!B20<>\"\",Definitioner!B20,\"\")","v":"Sum af 7 PAH'er"},4,40,40]
[19,{"$f":"IF(Definitioner!B21<>\"\",Definitioner!B21,\"\")","v":"Benz(a)pyren"},0.3,3,3]
[20,{"$f":"IF(Definitioner!B22<>\"\",Definitioner!B22,\"\")","v":"Dibenz(a,h)anthracen"},0.3,3,3]
[21,{"$f":"IF(Definitioner!B23<>\"\",Definitioner!B23,\"\")","v":"Phenoler, sum"}]
[22,{"$f":"IF(Definitioner!B24<>\"\",Definitioner!B24,\"\")","v":"Cyanid, total"}]
[23,{"$f":"IF(Definitioner!B25<>\"\",Definitioner!B25,\"\")","v":"Cyanid, syreflygtig"}]
[24,{"$f":"IF(Definitioner!B26<>\"\",Definitioner!B26,\"\")","v":"Fluoranthen"}]
[25,{"$f":"IF(Definitioner!B27<>\"\",Definitioner!B27,\"\")","v":"Benz(b+j+k)fluoranthen"}]
[26,{"$f":"IF(Definitioner!B28<>\"\",Definitioner!B28,\"\")","v":"Indeno(1,2,3-cd)pyren"}]
[27,{"$f":"IF(Definitioner!B29<>\"\",Definitioner!B29,\"\")","v":"Chrom (bortset fra VI)"}]
[28,{"$f":"IF(Definitioner!B30<>\"\",Definitioner!B30,\"\")","v":"Sum C6-C40 (Reflab4)"}]
[29,{"$f":"IF(Definitioner!B31<>\"\",Definitioner!B31,\"\")","v":"C6-C10 (Reflab4)"}]
[30,{"$f":"IF(Definitioner!B32<>\"\",Definitioner!B32,\"\")","v":"C10-C20 (Reflab4)"}]
[31,{"$f":"IF(Definitioner!B33<>\"\",Definitioner!B33,\"\")","v":"C10-C15 (Reflab4)"}]
[32,{"$f":"IF(Definitioner!B34<>\"\",Definitioner!B34,\"\")","v":"C15-C20 (Reflab4)"}]
[33,{"$f":"IF(Definitioner!B35<>\"\",Definitioner!B35,\"\")","v":"C20-C40 (Reflab4)"}]
[34,{"$f":"IF(Definitioner!B36<>\"\",Definitioner!B36,\"\")","v":"Terpentin (C7-C12) (Reflab1)"}]
[35,{"$f":"IF(Definitioner!B37<>\"\",Definitioner!B37,\"\")","v":"Petroleum (C9-C16) (Reflab1)"}]
[36,{"$f":"IF(Definitioner!B38<>\"\",Definitioner!B38,\"\")","v":"Terpentin (C7-C12) (Reflab4)"}]
[37,{"$f":"IF(Definitioner!B39<>\"\",Definitioner!B39,\"\")","v":"Petroleum (C9-C16) (Reflab4)"}]
[39,{"$f":"IF(Definitioner!B40<>\"\",Definitioner!B40,\"\")","v":"Molybdæn"}]
[40,{"$f":"IF(Definitioner!B41<>\"\",Definitioner!B41,\"\")","v":"MTBE"}]
[41,{"$f":"IF(Definitioner!B42<>\"\",Definitioner!B42,\"\")","v":"Trichlorethylen"}]
[42,{"$f":"IF(Definitioner!B43<>\"\",Definitioner!B43,\"\")","v":"Tetrachlorethylen"}]
[43,{"$f":"IF(Definitioner!B44<>\"\",Definitioner!B44,\"\")","v":"Tetrachlormethan"}]
[44,{"$f":"IF(Definitioner!B45<>\"\",Definitioner!B45,\"\")","v":"Toluen"}]
[45,{"$f":"IF(Definitioner!B46<>\"\",Definitioner!B46,\"\")","v":"Ethylbenzen"}]
[46,{"$f":"IF(Definitioner!B47<>\"\",Definitioner!B47,\"\")","v":"o-Xylen"}]
[47,{"$f":"IF(Definitioner!B48<>\"\",Definitioner!B48,\"\")","v":"m+p-Xylen"}]
[48,{"$f":"IF(Definitioner!B49<>\"\",Definitioner!B49,\"\")","v":"C20-C35 (Reflab1)"},100,300,300]
[49,{"$f":"IF(Definitioner!B50<>\"\",Definitioner!B50,\"\")","v":"C15-C20 (Reflab1)"},55,55,55]
[50,{"$f":"IF(Definitioner!B51<>\"\",Definitioner!B51,\"\")","v":"C10-C15 (Reflab1)"},40,40,40]
[51,{"$f":"IF(Definitioner!B52<>\"\",Definitioner!B52,\"\")","v":"Sum C10-C20 (Reflab4)"}]
[52,{"$f":"IF(Definitioner!B53<>\"\",Definitioner!B53,\"\")","v":"Sum C10-C20 (Reflab1)"}]
[53,{"$f":"IF(Definitioner!B54<>\"\",Definitioner!B54,\"\")","v":"Vinylchlorid"}]
[54,{"$f":"IF(Definitioner!B55<>\"\",Definitioner!B55,\"\")","v":"1,1-dichlorethylen"}]
[55,{"$f":"IF(Definitioner!B56<>\"\",Definitioner!B56,\"\")","v":"trans-1,2-dichlorethylen"}]
[56,{"$f":"IF(Definitioner!B57<>\"\",Definitioner!B57,\"\")","v":"1,1-dichlorethan"}]
[57,{"$f":"IF(Definitioner!B58<>\"\",Definitioner!B58,\"\")","v":"cis-1,2-dichlorethylen"}]
[58,{"$f":"IF(Definitioner!B59<>\"\",Definitioner!B59,\"\")","v":"Dichlormethan"}]
[59,{"$f":"IF(Definitioner!B60<>\"\",Definitioner!B60,\"\")","v":"1,1,2-trichlorethan"}]
[60,{"$f":"IF(Definitioner!B61<>\"\",Definitioner!B61,\"\")","v":"1,2-dichlorethan"}]
[61,{"$f":"IF(Definitioner!B62<>\"\",Definitioner!B62,\"\")","v":"1,2-dibromethan"}]
[62,{"$f":"IF(Definitioner!B63<>\"\",Definitioner!B63,\"\")","v":"Chlorbenzen"}]
[63,{"$f":"IF(Definitioner!B64<>\"\",Definitioner!B64,\"\")","v":"1,2-dichlorbenzen"}]
[64,{"$f":"IF(Definitioner!B65<>\"\",Definitioner!B65,\"\")","v":"1,4-dichlorbenzen"}]
[65,{"$f":"IF(Definitioner!B66<>\"\",Definitioner!B66,\"\")","v":"Chlorethan"}]
[66,{"$f":"IF(Definitioner!B67<>\"\",Definitioner!B67,\"\")","v":"TBA (tert-butyl-alkohol)"}]
[67,{"$f":"IF(Definitioner!B68<>\"\",Definitioner!B68,\"\")","v":"methanol"}]
[68,{"$f":"IF(Definitioner!B69<>\"\",Definitioner!B69,\"\")","v":"Ethanol"}]
[69,{"$f":"IF(Definitioner!B70<>\"\",Definitioner!B70,\"\")","v":"diethylether"}]
[70,{"$f":"IF(Definitioner!B71<>\"\",Definitioner!B71,\"\")","v":"acetone"}]
[71,{"$f":"IF(Definitioner!B72<>\"\",Definitioner!B72,\"\")","v":"isopropanol"}]
[72,{"$f":"IF(Definitioner!B73<>\"\",Definitioner!B73,\"\")","v":"1-propanol"}]
[73,{"$f":"IF(Definitioner!B74<>\"\",Definitioner!B74,\"\")","v":"diisopropylether"}]
[74,{"$f":"IF(Definitioner!B75<>\"\",Definitioner!B75,\"\")","v":"MEK"}]
[75,{"$f":"IF(Definitioner!B76<>\"\",Definitioner!B76,\"\")","v":"ethylacetat"}]
[76,{"$f":"IF(Definitioner!B77<>\"\",Definitioner!B77,\"\")","v":"methylacrylat"}]
[77,{"$f":"IF(Definitioner!B78<>\"\",Definitioner!B78,\"\")","v":"isobutanol"}]
[78,{"$f":"IF(Definitioner!B79<>\"\",Definitioner!B79,\"\")","v":"isopropylacetat"}]
[79,{"$f":"IF(Definitioner!B80<>\"\",Definitioner!B80,\"\")","v":"1-butanol"}]
[80,{"$f":"IF(Definitioner!B81<>\"\",Definitioner!B81,\"\")","v":"methylmetacrylat"}]
[81,{"$f":"IF(Definitioner!B82<>\"\",Definitioner!B82,\"\")","v":"MIBK"}]
[82,{"$f":"IF(Definitioner!B83<>\"\",Definitioner!B83,\"\")","v":"isobutylacetat"}]
[83,{"$f":"IF(Definitioner!B84<>\"\",Definitioner!B84,\"\")","v":"butylacetat"}]
[84,{"$f":"IF(Definitioner!B85<>\"\",Definitioner!B85,\"\")","v":"Vinylacetat"}]
[85,{"$f":"IF(Definitioner!B86<>\"\",Definitioner!B86,\"\")","v":"Acetaldehyd"}]
[86,{"$f":"IF(Definitioner!B87<>\"\",Definitioner!B87,\"\")","v":"Sum af xylener"}]
[87,{"$f":"IF(Definitioner!B88<>\"\",Definitioner!B88,\"\")","v":"Svovl, total"}]
[88,{"$f":"IF(Definitioner!B89<>\"\",Definitioner!B89,\"\")","v":"Chloroform"}]
[89,{"$f":"IF(Definitioner!B90<>\"\",Definitioner!B90,\"\")","v":"1,1,1-trichlorethan"}]
[90,{"$f":"IF(Definitioner!B91<>\"\",Definitioner!B91,\"\")","v":"Cyanid, total"}]
[91,{"$f":"IF(Definitioner!B92<>\"\",Definitioner!B92,\"\")","v":"Pentachlorphenol"}]
[92,{"$f":"IF(Definitioner!B93<>\"\",Definitioner!B93,\"\")","v":"Barium"}]
[93,{"$f":"IF(Definitioner!B94<>\"\",Definitioner!B94,\"\")","v":"PCB(total)*5"}]
[94,{"$f":"IF(Definitioner!B95<>\"\",Definitioner!B95,\"\")","v":"Chlorparaffiner C10-C13"}]
[95,{"$f":"IF(Definitioner!B96<>\"\",Definitioner!B96,\"\")","v":"Chlorparaffiner C14-C17"}]
[96,{"$f":"IF(Definitioner!B97<>\"\",Definitioner!B97,\"\")","v":"Asbest"}]
[97,{"$f":"IF(Definitioner!B98<>\"\",Definitioner!B98,\"\")","v":"Aquatic Acute 1(H400)"}]
[98,{"$f":"IF(Definitioner!B99<>\"\",Definitioner!B99,\"\")","v":"Aquatic Chronic 1 (H410)"}]
[99,{"$f":"IF(Definitioner!B100<>\"\",Definitioner!B100,\"\")","v":"Tørstof"}]

{"sheet":"11","index":19,"n_rows":102,"n_cols":5,"rows_kept":102,"cut":false,"hidden":true,"merged":[]}
["HB Jord",null,"(Holbækmotorvejen og jernbanen)"]
[null,null,"<=","<=",">"]
["Parameter ID","Parameter","Kategori 1","Kategori 2","Udenfor Kat."]
[0,{"$f":"IF(Definitioner!B2<>\"\",Definitioner!B2,\"\")","v":"Dybde"}]
[1,{"$f":"IF(Definitioner!B3<>\"\",Definitioner!B3,\"\")","v":"Arsen"}]
[2,{"$f":"IF(Definitioner!B4<>\"\",Definitioner!B4,\"\")","v":"Bly "},40,400,400]
[3,{"$f":"IF(Definitioner!B5<>\"\",Definitioner!B5,\"\")","v":"Cadmium"},0.5,5,5]
[4,{"$f":"IF(Definitioner!B6<>\"\",Definitioner!B6,\"\")","v":"Chrom VI"}]
[5,{"$f":"IF(Definitioner!B7<>\"\",Definitioner!B7,\"\")","v":"Chrom total"},500,1000,1000]
[6,{"$f":"IF(Definitioner!B8<>\"\",Definitioner!B8,\"\")","v":"Kobber "},500,1000,1000]
[7,{"$f":"IF(Definitioner!B9<>\"\",Definitioner!B9,\"\")","v":"Kviksølv"},1,3,3]
[8,{"$f":"IF(Definitioner!B10<>\"\",Definitioner!B10,\"\")","v":"Nikkel"},30,30,30]
[9,{"$f":"IF(Definitioner!B11<>\"\",Definitioner!B11,\"\")","v":"Tin"}]
[10,{"$f":"IF(Definitioner!B12<>\"\",Definitioner!B12,\"\")","v":"Zink"},500,1000,1000]
[11,{"$f":"IF(Definitioner!B13<>\"\",Definitioner!B13,\"\")","v":"Sum C6-C35 (Reflab1)"},100,300,300]
[12,{"$f":"IF(Definitioner!B14<>\"\",Definitioner!B14,\"\")","v":"C6-C10 (Reflab1)"},25,25,25]
[13,{"$f":"IF(Definitioner!B15<>\"\",Definitioner!B15,\"\")","v":"C10-C25 (Reflab1 gl.)"}]
[14,{"$f":"IF(Definitioner!B16<>\"\",Definitioner!B16,\"\")","v":"C25-C35 (Reflab1 gl.)"}]
[15,{"$f":"IF(Definitioner!B17<>\"\",Definitioner!B17,\"\")","v":"BTEX, sum"},0.6,0.6,0.6]
[16,{"$f":"IF(Definitioner!B18<>\"\",Definitioner!B18,\"\")","v":"Benzen"},0.1,0.1,0.1]
[17,{"$f":"IF(Definitioner!B19<>\"\",Definitioner!B19,\"\")","v":"Naphtalen"},0.5,0.5,0.5]
[18,{"$f":"IF(Definitioner!B20<>\"\",Definitioner!B20,\"\")","v":"Sum af 7 PAH'er"},4,40,40]
[19,{"$f":"IF(Definitioner!B21<>\"\",Definitioner!B21,\"\")","v":"Benz(a)pyren"},0.3,3,3]
[20,{"$f":"IF(Definitioner!B22<>\"\",Definitioner!B22,\"\")","v":"Dibenz(a,h)anthracen"},0.3,3,3]
[21,{"$f":"IF(Definitioner!B23<>\"\",Definitioner!B23,\"\")","v":"Phenoler, sum"}]
[22,{"$f":"IF(Definitioner!B24<>\"\",Definitioner!B24,\"\")","v":"Cyanid, total"}]
[23,{"$f":"IF(Definitioner!B25<>\"\",Definitioner!B25,\"\")","v":"Cyanid, syreflygtig"}]
[24,{"$f":"IF(Definitioner!B26<>\"\",Definitioner!B26,\"\")","v":"Fluoranthen"}]
[25,{"$f":"IF(Definitioner!B27<>\"\",Definitioner!B27,\"\")","v":"Benz(b+j+k)fluoranthen"}]
[26,{"$f":"IF(Definitioner!B28<>\"\",Definitioner!B28,\"\")","v":"Indeno(1,2,3-cd)pyren"}]
[27,{"$f":"IF(Definitioner!B29<>\"\",Definitioner!B29,\"\")","v":"Chrom (bortset fra VI)"}]
[28,{"$f":"IF(Definitioner!B30<>\"\",Definitioner!B30,\"\")","v":"Sum C6-C40 (Reflab4)"}]
[29,{"$f":"IF(Definitioner!B31<>\"\",Definitioner!B31,\"\")","v":"C6-C10 (Reflab4)"}]
[30,{"$f":"IF(Definitioner!B32<>\"\",Definitioner!B32,\"\")","v":"C10-C20 (Reflab4)"}]
[31,{"$f":"IF(Definitioner!B33<>\"\",Definitioner!B33,\"\")","v":"C10-C15 (Reflab4)"}]
[32,{"$f":"IF(Definitioner!B34<>\"\",Definitioner!B34,\"\")","v":"C15-C20 (Reflab4)"}]
[33,{"$f":"IF(Definitioner!B35<>\"\",Definitioner!B35,\"\")","v":"C20-C40 (Reflab4)"}]
[34,{"$f":"IF(Definitioner!B36<>\"\",Definitioner!B36,\"\")","v":"Terpentin (C7-C12) (Reflab1)"}]
[35,{"$f":"IF(Definitioner!B37<>\"\",Definitioner!B37,\"\")","v":"Petroleum (C9-C16) (Reflab1)"}]
[36,{"$f":"IF(Definitioner!B38<>\"\",Definitioner!B38,\"\")","v":"Terpentin (C7-C12) (Reflab4)"}]
[37,{"$f":"IF(Definitioner!B39<>\"\",Definitioner!B39,\"\")","v":"Petroleum (C9-C16) (Reflab4)"}]
[39,{"$f":"IF(Definitioner!B40<>\"\",Definitioner!B40,\"\")","v":"Molybdæn"}]
[40,{"$f":"IF(Definitioner!B41<>\"\",Definitioner!B41,\"\")","v":"MTBE"}]
[41,{"$f":"IF(Definitioner!B42<>\"\",Definitioner!B42,\"\")","v":"Trichlorethylen"}]
[42,{"$f":"IF(Definitioner!B43<>\"\",Definitioner!B43,\"\")","v":"Tetrachlorethylen"}]
[43,{"$f":"IF(Definitioner!B44<>\"\",Definitioner!B44,\"\")","v":"Tetrachlormethan"}]
[44,{"$f":"IF(Definitioner!B45<>\"\",Definitioner!B45,\"\")","v":"Toluen"}]
[45,{"$f":"IF(Definitioner!B46<>\"\",Definitioner!B46,\"\")","v":"Ethylbenzen"}]
[46,{"$f":"IF(Definitioner!B47<>\"\",Definitioner!B47,\"\")","v":"o-Xylen"}]
[47,{"$f":"IF(Definitioner!B48<>\"\",Definitioner!B48,\"\")","v":"m+p-Xylen"}]
[48,{"$f":"IF(Definitioner!B49<>\"\",Definitioner!B49,\"\")","v":"C20-C35 (Reflab1)"},100,300,300]
[49,{"$f":"IF(Definitioner!B50<>\"\",Definitioner!B50,\"\")","v":"C15-C20 (Reflab1)"},55,55,55]
[50,{"$f":"IF(Definitioner!B51<>\"\",Definitioner!B51,\"\")","v":"C10-C15 (Reflab1)"},40,40,40]
[51,{"$f":"IF(Definitioner!B52<>\"\",Definitioner!B52,\"\")","v":"Sum C10-C20 (Reflab4)"}]
[52,{"$f":"IF(Definitioner!B53<>\"\",Definitioner!B53,\"\")","v":"Sum C10-C20 (Reflab1)"}]
[53,{"$f":"IF(Definitioner!B54<>\"\",Definitioner!B54,\"\")","v":"Vinylchlorid"}]
[54,{"$f":"IF(Definitioner!B55<>\"\",Definitioner!B55,\"\")","v":"1,1-dichlorethylen"}]
[55,{"$f":"IF(Definitioner!B56<>\"\",Definitioner!B56,\"\")","v":"trans-1,2-dichlorethylen"}]
[56,{"$f":"IF(Definitioner!B57<>\"\",Definitioner!B57,\"\")","v":"1,1-dichlorethan"}]
[57,{"$f":"IF(Definitioner!B58<>\"\",Definitioner!B58,\"\")","v":"cis-1,2-dichlorethylen"}]
[58,{"$f":"IF(Definitioner!B59<>\"\",Definitioner!B59,\"\")","v":"Dichlormethan"}]
[59,{"$f":"IF(Definitioner!B60<>\"\",Definitioner!B60,\"\")","v":"1,1,2-trichlorethan"}]
[60,{"$f":"IF(Definitioner!B61<>\"\",Definitioner!B61,\"\")","v":"1,2-dichlorethan"}]
[61,{"$f":"IF(Definitioner!B62<>\"\",Definitioner!B62,\"\")","v":"1,2-dibromethan"}]
[62,{"$f":"IF(Definitioner!B63<>\"\",Definitioner!B63,\"\")","v":"Chlorbenzen"}]
[63,{"$f":"IF(Definitioner!B64<>\"\",Definitioner!B64,\"\")","v":"1,2-dichlorbenzen"}]
[64,{"$f":"IF(Definitioner!B65<>\"\",Definitioner!B65,\"\")","v":"1,4-dichlorbenzen"}]
[65,{"$f":"IF(Definitioner!B66<>\"\",Definitioner!B66,\"\")","v":"Chlorethan"}]
[66,{"$f":"IF(Definitioner!B67<>\"\",Definitioner!B67,\"\")","v":"TBA (tert-butyl-alkohol)"}]
[67,{"$f":"IF(Definitioner!B68<>\"\",Definitioner!B68,\"\")","v":"methanol"}]
[68,{"$f":"IF(Definitioner!B69<>\"\",Definitioner!B69,\"\")","v":"Ethanol"}]
[69,{"$f":"IF(Definitioner!B70<>\"\",Definitioner!B70,\"\")","v":"diethylether"}]
[70,{"$f":"IF(Definitioner!B71<>\"\",Definitioner!B71,\"\")","v":"acetone"}]
[71,{"$f":"IF(Definitioner!B72<>\"\",Definitioner!B72,\"\")","v":"isopropanol"}]
[72,{"$f":"IF(Definitioner!B73<>\"\",Definitioner!B73,\"\")","v":"1-propanol"}]
[73,{"$f":"IF(Definitioner!B74<>\"\",Definitioner!B74,\"\")","v":"diisopropylether"}]
[74,{"$f":"IF(Definitioner!B75<>\"\",Definitioner!B75,\"\")","v":"MEK"}]
[75,{"$f":"IF(Definitioner!B76<>\"\",Definitioner!B76,\"\")","v":"ethylacetat"}]
[76,{"$f":"IF(Definitioner!B77<>\"\",Definitioner!B77,\"\")","v":"methylacrylat"}]
[77,{"$f":"IF(Definitioner!B78<>\"\",Definitioner!B78,\"\")","v":"isobutanol"}]
[78,{"$f":"IF(Definitioner!B79<>\"\",Definitioner!B79,\"\")","v":"isopropylacetat"}]
[79,{"$f":"IF(Definitioner!B80<>\"\",Definitioner!B80,\"\")","v":"1-butanol"}]
[80,{"$f":"IF(Definitioner!B81<>\"\",Definitioner!B81,\"\")","v":"methylmetacrylat"}]
[81,{"$f":"IF(Definitioner!B82<>\"\",Definitioner!B82,\"\")","v":"MIBK"}]
[82,{"$f":"IF(Definitioner!B83<>\"\",Definitioner!B83,\"\")","v":"isobutylacetat"}]
[83,{"$f":"IF(Definitioner!B84<>\"\",Definitioner!B84,\"\")","v":"butylacetat"}]
[84,{"$f":"IF(Definitioner!B85<>\"\",Definitioner!B85,\"\")","v":"Vinylacetat"}]
[85,{"$f":"IF(Definitioner!B86<>\"\",Definitioner!B86,\"\")","v":"Acetaldehyd"}]
[86,{"$f":"IF(Definitioner!B87<>\"\",Definitioner!B87,\"\")","v":"Sum af xylener"}]
[87,{"$f":"IF(Definitioner!B88<>\"\",Definitioner!B88,\"\")","v":"Svovl, total"}]
[88,{"$f":"IF(Definitioner!B89<>\"\",Definitioner!B89,\"\")","v":"Chloroform"}]
[89,{"$f":"IF(Definitioner!B90<>\"\",Definitioner!B90,\"\")","v":"1,1,1-trichlorethan"}]
[90,{"$f":"IF(Definitioner!B91<>\"\",Definitioner!B91,\"\")","v":"Cyanid, total"}]
[91,{"$f":"IF(Definitioner!B92<>\"\",Definitioner!B92,\"\")","v":"Pentachlorphenol"}]
[92,{"$f":"IF(Definitioner!B93<>\"\",Definitioner!B93,\"\")","v":"Barium"}]
[93,{"$f":"IF(Definitioner!B94<>\"\",Definitioner!B94,\"\")","v":"PCB(total)*5"}]
[94,{"$f":"IF(Definitioner!B95<>\"\",Definitioner!B95,\"\")","v":"Chlorparaffiner C10-C13"}]
[95,{"$f":"IF(Definitioner!B96<>\"\",Definitioner!B96,\"\")","v":"Chlorparaffiner C14-C17"}]
[96,{"$f":"IF(Definitioner!B97<>\"\",Definitioner!B97,\"\")","v":"Asbest"}]
[97,{"$f":"IF(Definitioner!B98<>\"\",Definitioner!B98,\"\")","v":"Aquatic Acute 1(H400)"}]
[98,{"$f":"IF(Definitioner!B99<>\"\",Definitioner!B99,\"\")","v":"Aquatic Chronic 1 (H410)"}]
[99,{"$f":"IF(Definitioner!B100<>\"\",Definitioner!B100,\"\")","v":"Tørstof"}]

{"sheet":"Udgået_5","index":20,"n_rows":102,"n_cols":5,"rows_kept":102,"cut":false,"hidden":true,"merged":[]}
["Bekendtgørelse nr.1662",null,"(Restproduktbekendtgørelsen)"]
[null,null,"<=",">",">"]
["Parameter ID","Parameter","Kategori 1","Kategori 2","Kategori 3"]
[0,{"$f":"IF(Definitioner!B2<>\"\",Definitioner!B2,\"\")","v":"Dybde"}]
[1,{"$f":"IF(Definitioner!B3<>\"\",Definitioner!B3,\"\")","v":"Arsen"},20,20,"-"]
[2,{"$f":"IF(Definitioner!B4<>\"\",Definitioner!B4,\"\")","v":"Bly "},40,40,"-"]
[3,{"$f":"IF(Definitioner!B5<>\"\",Definitioner!B5,\"\")","v":"Cadmium"},0.5,0.5,"-"]
[4,{"$f":"IF(Definitioner!B6<>\"\",Definitioner!B6,\"\")","v":"Chrom VI"},20,20,"-"]
[5,{"$f":"IF(Definitioner!B7<>\"\",Definitioner!B7,\"\")","v":"Chrom total"},500,500,"-"]
[6,{"$f":"IF(Definitioner!B8<>\"\",Definitioner!B8,\"\")","v":"Kobber "},500,500,"-"]
[7,{"$f":"IF(Definitioner!B9<>\"\",Definitioner!B9,\"\")","v":"Kviksølv"},1,1,"-"]
[8,{"$f":"IF(Definitioner!B10<>\"\",Definitioner!B10,\"\")","v":"Nikkel"},30,30,"-"]
[9,{"$f":"IF(Definitioner!B11<>\"\",Definitioner!B11,\"\")","v":"Tin"}]
[10,{"$f":"IF(Definitioner!B12<>\"\",Definitioner!B12,\"\")","v":"Zink"},500,500,"-"]
[11,{"$f":"IF(Definitioner!B13<>\"\",Definitioner!B13,\"\")","v":"Sum C6-C35 (Reflab1)"}]
[12,{"$f":"IF(Definitioner!B14<>\"\",Definitioner!B14,\"\")","v":"C6-C10 (Reflab1)"}]
[13,{"$f":"IF(Definitioner!B15<>\"\",Definitioner!B15,\"\")","v":"C10-C25 (Reflab1 gl.)"}]
[14,{"$f":"IF(Definitioner!B16<>\"\",Definitioner!B16,\"\")","v":"C25-C35 (Reflab1 gl.)"}]
[15,{"$f":"IF(Definitioner!B17<>\"\",Definitioner!B17,\"\")","v":"BTEX, sum"}]
[16,{"$f":"IF(Definitioner!B18<>\"\",Definitioner!B18,\"\")","v":"Benzen"}]
[17,{"$f":"IF(Definitioner!B19<>\"\",Definitioner!B19,\"\")","v":"Naphtalen"}]
[18,{"$f":"IF(Definitioner!B20<>\"\",Definitioner!B20,\"\")","v":"Sum af 7 PAH'er"}]
[19,{"$f":"IF(Definitioner!B21<>\"\",Definitioner!B21,\"\")","v":"Benz(a)pyren"}]
[20,{"$f":"IF(Definitioner!B22<>\"\",Definitioner!B22,\"\")","v":"Dibenz(a,h)anthracen"}]
[21,{"$f":"IF(Definitioner!B23<>\"\",Definitioner!B23,\"\")","v":"Phenoler, sum"}]
[22,{"$f":"IF(Definitioner!B24<>\"\",Definitioner!B24,\"\")","v":"Cyanid, total"}]
[23,{"$f":"IF(Definitioner!B25<>\"\",Definitioner!B25,\"\")","v":"Cyanid, syreflygtig"}]
[24,{"$f":"IF(Definitioner!B26<>\"\",Definitioner!B26,\"\")","v":"Fluoranthen"}]
[25,{"$f":"IF(Definitioner!B27<>\"\",Definitioner!B27,\"\")","v":"Benz(b+j+k)fluoranthen"}]
[26,{"$f":"IF(Definitioner!B28<>\"\",Definitioner!B28,\"\")","v":"Indeno(1,2,3-cd)pyren"}]
[27,{"$f":"IF(Definitioner!B29<>\"\",Definitioner!B29,\"\")","v":"Chrom (bortset fra VI)"}]
[28,{"$f":"IF(Definitioner!B30<>\"\",Definitioner!B30,\"\")","v":"Sum C6-C40 (Reflab4)"}]
[29,{"$f":"IF(Definitioner!B31<>\"\",Definitioner!B31,\"\")","v":"C6-C10 (Reflab4)"}]
[30,{"$f":"IF(Definitioner!B32<>\"\",Definitioner!B32,\"\")","v":"C10-C20 (Reflab4)"}]
[31,{"$f":"IF(Definitioner!B33<>\"\",Definitioner!B33,\"\")","v":"C10-C15 (Reflab4)"}]
[32,{"$f":"IF(Definitioner!B34<>\"\",Definitioner!B34,\"\")","v":"C15-C20 (Reflab4)"}]
[33,{"$f":"IF(Definitioner!B35<>\"\",Definitioner!B35,\"\")","v":"C20-C40 (Reflab4)"}]
[34,{"$f":"IF(Definitioner!B36<>\"\",Definitioner!B36,\"\")","v":"Terpentin (C7-C12) (Reflab1)"}]
[35,{"$f":"IF(Definitioner!B37<>\"\",Definitioner!B37,\"\")","v":"Petroleum (C9-C16) (Reflab1)"}]
[36,{"$f":"IF(Definitioner!B38<>\"\",Definitioner!B38,\"\")","v":"Terpentin (C7-C12) (Reflab4)"}]
[37,{"$f":"IF(Definitioner!B39<>\"\",Definitioner!B39,\"\")","v":"Petroleum (C9-C16) (Reflab4)"}]
[39,{"$f":"IF(Definitioner!B40<>\"\",Definitioner!B40,\"\")","v":"Molybdæn"}]
[40,{"$f":"IF(Definitioner!B41<>\"\",Definitioner!B41,\"\")","v":"MTBE"}]
[41,{"$f":"IF(Definitioner!B42<>\"\",Definitioner!B42,\"\")","v":"Trichlorethylen"}]
[42,{"$f":"IF(Definitioner!B43<>\"\",Definitioner!B43,\"\")","v":"Tetrachlorethylen"}]
[43,{"$f":"IF(Definitioner!B44<>\"\",Definitioner!B44,\"\")","v":"Tetrachlormethan"}]
[44,{"$f":"IF(Definitioner!B45<>\"\",Definitioner!B45,\"\")","v":"Toluen"}]
[45,{"$f":"IF(Definitioner!B46<>\"\",Definitioner!B46,\"\")","v":"Ethylbenzen"}]
[46,{"$f":"IF(Definitioner!B47<>\"\",Definitioner!B47,\"\")","v":"o-Xylen"}]
[47,{"$f":"IF(Definitioner!B48<>\"\",Definitioner!B48,\"\")","v":"m+p-Xylen"}]
[48,{"$f":"IF(Definitioner!B49<>\"\",Definitioner!B49,\"\")","v":"C20-C35 (Reflab1)"}]
[49,{"$f":"IF(Definitioner!B50<>\"\",Definitioner!B50,\"\")","v":"C15-C20 (Reflab1)"}]
[50,{"$f":"IF(Definitioner!B51<>\"\",Definitioner!B51,\"\")","v":"C10-C15 (Reflab1)"}]
[51,{"$f":"IF(Definitioner!B52<>\"\",Definitioner!B52,\"\")","v":"Sum C10-C20 (Reflab4)"}]
[52,{"$f":"IF(Definitioner!B53<>\"\",Definitioner!B53,\"\")","v":"Sum C10-C20 (Reflab1)"}]
[53,{"$f":"IF(Definitioner!B54<>\"\",Definitioner!B54,\"\")","v":"Vinylchlorid"}]
[54,{"$f":"IF(Definitioner!B55<>\"\",Definitioner!B55,\"\")","v":"1,1-dichlorethylen"}]
[55,{"$f":"IF(Definitioner!B56<>\"\",Definitioner!B56,\"\")","v":"trans-1,2-dichlorethylen"}]
[56,{"$f":"IF(Definitioner!B57<>\"\",Definitioner!B57,\"\")","v":"1,1-dichlorethan"}]
[57,{"$f":"IF(Definitioner!B58<>\"\",Definitioner!B58,\"\")","v":"cis-1,2-dichlorethylen"}]
[58,{"$f":"IF(Definitioner!B59<>\"\",Definitioner!B59,\"\")","v":"Dichlormethan"}]
[59,{"$f":"IF(Definitioner!B60<>\"\",Definitioner!B60,\"\")","v":"1,1,2-trichlorethan"}]
[60,{"$f":"IF(Definitioner!B61<>\"\",Definitioner!B61,\"\")","v":"1,2-dichlorethan"}]
[61,{"$f":"IF(Definitioner!B62<>\"\",Definitioner!B62,\"\")","v":"1,2-dibromethan"}]
[62,{"$f":"IF(Definitioner!B63<>\"\",Definitioner!B63,\"\")","v":"Chlorbenzen"}]
[63,{"$f":"IF(Definitioner!B64<>\"\",Definitioner!B64,\"\")","v":"1,2-dichlorbenzen"}]
[64,{"$f":"IF(Definitioner!B65<>\"\",Definitioner!B65,\"\")","v":"1,4-dichlorbenzen"}]
[65,{"$f":"IF(Definitioner!B66<>\"\",Definitioner!B66,\"\")","v":"Chlorethan"}]
[66,{"$f":"IF(Definitioner!B67<>\"\",Definitioner!B67,\"\")","v":"TBA (tert-butyl-alkohol)"}]
[67,{"$f":"IF(Definitioner!B68<>\"\",Definitioner!B68,\"\")","v":"methanol"}]
[68,{"$f":"IF(Definitioner!B69<>\"\",Definitioner!B69,\"\")","v":"Ethanol"}]
[69,{"$f":"IF(Definitioner!B70<>\"\",Definitioner!B70,\"\")","v":"diethylether"}]
[70,{"$f":"IF(Definitioner!B71<>\"\",Definitioner!B71,\"\")","v":"acetone"}]
[71,{"$f":"IF(Definitioner!B72<>\"\",Definitioner!B72,\"\")","v":"isopropanol"}]
[72,{"$f":"IF(Definitioner!B73<>\"\",Definitioner!B73,\"\")","v":"1-propanol"}]
[73,{"$f":"IF(Definitioner!B74<>\"\",Definitioner!B74,\"\")","v":"diisopropylether"}]
[74,{"$f":"IF(Definitioner!B75<>\"\",Definitioner!B75,\"\")","v":"MEK"}]
[75,{"$f":"IF(Definitioner!B76<>\"\",Definitioner!B76,\"\")","v":"ethylacetat"}]
[76,{"$f":"IF(Definitioner!B77<>\"\",Definitioner!B77,\"\")","v":"methylacrylat"}]
[77,{"$f":"IF(Definitioner!B78<>\"\",Definitioner!B78,\"\")","v":"isobutanol"}]
[78,{"$f":"IF(Definitioner!B79<>\"\",Definitioner!B79,\"\")","v":"isopropylacetat"}]
[79,{"$f":"IF(Definitioner!B80<>\"\",Definitioner!B80,\"\")","v":"1-butanol"}]
[80,{"$f":"IF(Definitioner!B81<>\"\",Definitioner!B81,\"\")","v":"methylmetacrylat"}]
[81,{"$f":"IF(Definitioner!B82<>\"\",Definitioner!B82,\"\")","v":"MIBK"}]
[82,{"$f":"IF(Definitioner!B83<>\"\",Definitioner!B83,\"\")","v":"isobutylacetat"}]
[83,{"$f":"IF(Definitioner!B84<>\"\",Definitioner!B84,\"\")","v":"butylacetat"}]
[84,{"$f":"IF(Definitioner!B85<>\"\",Definitioner!B85,\"\")","v":"Vinylacetat"}]
[85,{"$f":"IF(Definitioner!B86<>\"\",Definitioner!B86,\"\")","v":"Acetaldehyd"}]
[86,{"$f":"IF(Definitioner!B87<>\"\",Definitioner!B87,\"\")","v":"Sum af xylener"}]
[87,{"$f":"IF(Definitioner!B88<>\"\",Definitioner!B88,\"\")","v":"Svovl, total"}]
[88,{"$f":"IF(Definitioner!B89<>\"\",Definitioner!B89,\"\")","v":"Chloroform"}]
[89,{"$f":"IF(Definitioner!B90<>\"\",Definitioner!B90,\"\")","v":"1,1,1-trichlorethan"}]
[90,{"$f":"IF(Definitioner!B91<>\"\",Definitioner!B91,\"\")","v":"Cyanid, total"}]
[91,{"$f":"IF(Definitioner!B92<>\"\",Definitioner!B92,\"\")","v":"Pentachlorphenol"}]
[92,{"$f":"IF(Definitioner!B93<>\"\",Definitioner!B93,\"\")","v":"Barium"}]
[93,{"$f":"IF(Definitioner!B94<>\"\",Definitioner!B94,\"\")","v":"PCB(total)*5"}]
[94,{"$f":"IF(Definitioner!B95<>\"\",Definitioner!B95,\"\")","v":"Chlorparaffiner C10-C13"}]
[95,{"$f":"IF(Definitioner!B96<>\"\",Definitioner!B96,\"\")","v":"Chlorparaffiner C14-C17"}]
[96,{"$f":"IF(Definitioner!B97<>\"\",Definitioner!B97,\"\")","v":"Asbest"}]
[97,{"$f":"IF(Definitioner!B98<>\"\",Definitioner!B98,\"\")","v":"Aquatic Acute 1(H400)"}]
[98,{"$f":"IF(Definitioner!B99<>\"\",Definitioner!B99,\"\")","v":"Aquatic Chronic 1 (H410)"}]
[99,{"$f":"IF(Definitioner!B100<>\"\",Definitioner!B100,\"\")","v":"Tørstof"}]

{"sheet":"2","index":21,"n_rows":102,"n_cols":5,"rows_kept":102,"cut":false,"hidden":true,"merged":[]}
["Bekendtgørelse nr.1452+554+Tilføjelser",null,"(Jordflytningsbekendtgørelsen)"]
[null,null,"<=","<=",">"]
["Parameter ID","Parameter","Kategori 1","Kategori 2","Udenfor Kat."]
[0,{"$f":"IF(Definitioner!B2<>\"\",Definitioner!B2,\"\")","v":"Dybde"}]
[1,{"$f":"IF(Definitioner!B3<>\"\",Definitioner!B3,\"\")","v":"Arsen"},20,20,20]
[2,{"$f":"IF(Definitioner!B4<>\"\",Definitioner!B4,\"\")","v":"Bly "},40,400,400]
[3,{"$f":"IF(Definitioner!B5<>\"\",Definitioner!B5,\"\")","v":"Cadmium"},0.5,5,5]
[4,{"$f":"IF(Definitioner!B6<>\"\",Definitioner!B6,\"\")","v":"Chrom VI"}]
[5,{"$f":"IF(Definitioner!B7<>\"\",Definitioner!B7,\"\")","v":"Chrom total"},500,1000,1000]
[6,{"$f":"IF(Definitioner!B8<>\"\",Definitioner!B8,\"\")","v":"Kobber "},500,1000,1000]
[7,{"$f":"IF(Definitioner!B9<>\"\",Definitioner!B9,\"\")","v":"Kviksølv"},1,3,3]
[8,{"$f":"IF(Definitioner!B10<>\"\",Definitioner!B10,\"\")","v":"Nikkel"},30,30,30]
[9,{"$f":"IF(Definitioner!B11<>\"\",Definitioner!B11,\"\")","v":"Tin"}]
[10,{"$f":"IF(Definitioner!B12<>\"\",Definitioner!B12,\"\")","v":"Zink"},500,1000,1000]
[11,{"$f":"IF(Definitioner!B13<>\"\",Definitioner!B13,\"\")","v":"Sum C6-C35 (Reflab1)"},100,300,300]
[12,{"$f":"IF(Definitioner!B14<>\"\",Definitioner!B14,\"\")","v":"C6-C10 (Reflab1)"},25,25,25]
[13,{"$f":"IF(Definitioner!B15<>\"\",Definitioner!B15,\"\")","v":"C10-C25 (Reflab1 gl.)"}]
[14,{"$f":"IF(Definitioner!B16<>\"\",Definitioner!B16,\"\")","v":"C25-C35 (Reflab1 gl.)"}]
[15,{"$f":"IF(Definitioner!B17<>\"\",Definitioner!B17,\"\")","v":"BTEX, sum"}]
[16,{"$f":"IF(Definitioner!B18<>\"\",Definitioner!B18,\"\")","v":"Benzen"},1.5,1.5,1.5]
[17,{"$f":"IF(Definitioner!B19<>\"\",Definitioner!B19,\"\")","v":"Naphtalen"}]
[18,{"$f":"IF(Definitioner!B20<>\"\",Definitioner!B20,\"\")","v":"Sum af 7 PAH'er"},4,40,40]
[19,{"$f":"IF(Definitioner!B21<>\"\",Definitioner!B21,\"\")","v":"Benz(a)pyren"},0.3,3,3]
[20,{"$f":"IF(Definitioner!B22<>\"\",Definitioner!B22,\"\")","v":"Dibenz(a,h)anthracen"},0.3,3,3]
[21,{"$f":"IF(Definitioner!B23<>\"\",Definitioner!B23,\"\")","v":"Phenoler, sum"}]
[22,{"$f":"IF(Definitioner!B24<>\"\",Definitioner!B24,\"\")","v":"Cyanid, total"}]
[23,{"$f":"IF(Definitioner!B25<>\"\",Definitioner!B25,\"\")","v":"Cyanid, syreflygtig"}]
[24,{"$f":"IF(Definitioner!B26<>\"\",Definitioner!B26,\"\")","v":"Fluoranthen"}]
[25,{"$f":"IF(Definitioner!B27<>\"\",Definitioner!B27,\"\")","v":"Benz(b+j+k)fluoranthen"}]
[26,{"$f":"IF(Definitioner!B28<>\"\",Definitioner!B28,\"\")","v":"Indeno(1,2,3-cd)pyren"}]
[27,{"$f":"IF(Definitioner!B29<>\"\",Definitioner!B29,\"\")","v":"Chrom (bortset fra VI)"}]
[28,{"$f":"IF(Definitioner!B30<>\"\",Definitioner!B30,\"\")","v":"Sum C6-C40 (Reflab4)"}]
[29,{"$f":"IF(Definitioner!B31<>\"\",Definitioner!B31,\"\")","v":"C6-C10 (Reflab4)"}]
[30,{"$f":"IF(Definitioner!B32<>\"\",Definitioner!B32,\"\")","v":"C10-C20 (Reflab4)"}]
[31,{"$f":"IF(Definitioner!B33<>\"\",Definitioner!B33,\"\")","v":"C10-C15 (Reflab4)"}]
[32,{"$f":"IF(Definitioner!B34<>\"\",Definitioner!B34,\"\")","v":"C15-C20 (Reflab4)"}]
[33,{"$f":"IF(Definitioner!B35<>\"\",Definitioner!B35,\"\")","v":"C20-C40 (Reflab4)"}]
[34,{"$f":"IF(Definitioner!B36<>\"\",Definitioner!B36,\"\")","v":"Terpentin (C7-C12) (Reflab1)"}]
[35,{"$f":"IF(Definitioner!B37<>\"\",Definitioner!B37,\"\")","v":"Petroleum (C9-C16) (Reflab1)"}]
[36,{"$f":"IF(Definitioner!B38<>\"\",Definitioner!B38,\"\")","v":"Terpentin (C7-C12) (Reflab4)"}]
[37,{"$f":"IF(Definitioner!B39<>\"\",Definitioner!B39,\"\")","v":"Petroleum (C9-C16) (Reflab4)"}]
[39,{"$f":"IF(Definitioner!B40<>\"\",Definitioner!B40,\"\")","v":"Molybdæn"}]
[40,{"$f":"IF(Definitioner!B41<>\"\",Definitioner!B41,\"\")","v":"MTBE"}]
[41,{"$f":"IF(Definitioner!B42<>\"\",Definitioner!B42,\"\")","v":"Trichlorethylen"}]
[42,{"$f":"IF(Definitioner!B43<>\"\",Definitioner!B43,\"\")","v":"Tetrachlorethylen"}]
[43,{"$f":"IF(Definitioner!B44<>\"\",Definitioner!B44,\"\")","v":"Tetrachlormethan"}]
[44,{"$f":"IF(Definitioner!B45<>\"\",Definitioner!B45,\"\")","v":"Toluen"}]
[45,{"$f":"IF(Definitioner!B46<>\"\",Definitioner!B46,\"\")","v":"Ethylbenzen"}]
[46,{"$f":"IF(Definitioner!B47<>\"\",Definitioner!B47,\"\")","v":"o-Xylen"}]
[47,{"$f":"IF(Definitioner!B48<>\"\",Definitioner!B48,\"\")","v":"m+p-Xylen"}]
[48,{"$f":"IF(Definitioner!B49<>\"\",Definitioner!B49,\"\")","v":"C20-C35 (Reflab1)"},100,300,300]
[49,{"$f":"IF(Definitioner!B50<>\"\",Definitioner!B50,\"\")","v":"C15-C20 (Reflab1)"},55,55,55]
[50,{"$f":"IF(Definitioner!B51<>\"\",Definitioner!B51,\"\")","v":"C10-C15 (Reflab1)"},40,40,40]
[51,{"$f":"IF(Definitioner!B52<>\"\",Definitioner!B52,\"\")","v":"Sum C10-C20 (Reflab4)"}]
[52,{"$f":"IF(Definitioner!B53<>\"\",Definitioner!B53,\"\")","v":"Sum C10-C20 (Reflab1)"}]
[53,{"$f":"IF(Definitioner!B54<>\"\",Definitioner!B54,\"\")","v":"Vinylchlorid"}]
[54,{"$f":"IF(Definitioner!B55<>\"\",Definitioner!B55,\"\")","v":"1,1-dichlorethylen"}]
[55,{"$f":"IF(Definitioner!B56<>\"\",Definitioner!B56,\"\")","v":"trans-1,2-dichlorethylen"}]
[56,{"$f":"IF(Definitioner!B57<>\"\",Definitioner!B57,\"\")","v":"1,1-dichlorethan"}]
[57,{"$f":"IF(Definitioner!B58<>\"\",Definitioner!B58,\"\")","v":"cis-1,2-dichlorethylen"}]
[58,{"$f":"IF(Definitioner!B59<>\"\",Definitioner!B59,\"\")","v":"Dichlormethan"}]
[59,{"$f":"IF(Definitioner!B60<>\"\",Definitioner!B60,\"\")","v":"1,1,2-trichlorethan"}]
[60,{"$f":"IF(Definitioner!B61<>\"\",Definitioner!B61,\"\")","v":"1,2-dichlorethan"}]
[61,{"$f":"IF(Definitioner!B62<>\"\",Definitioner!B62,\"\")","v":"1,2-dibromethan"}]
[62,{"$f":"IF(Definitioner!B63<>\"\",Definitioner!B63,\"\")","v":"Chlorbenzen"}]
[63,{"$f":"IF(Definitioner!B64<>\"\",Definitioner!B64,\"\")","v":"1,2-dichlorbenzen"}]
[64,{"$f":"IF(Definitioner!B65<>\"\",Definitioner!B65,\"\")","v":"1,4-dichlorbenzen"}]
[65,{"$f":"IF(Definitioner!B66<>\"\",Definitioner!B66,\"\")","v":"Chlorethan"}]
[66,{"$f":"IF(Definitioner!B67<>\"\",Definitioner!B67,\"\")","v":"TBA (tert-butyl-alkohol)"}]
[67,{"$f":"IF(Definitioner!B68<>\"\",Definitioner!B68,\"\")","v":"methanol"}]
[68,{"$f":"IF(Definitioner!B69<>\"\",Definitioner!B69,\"\")","v":"Ethanol"}]
[69,{"$f":"IF(Definitioner!B70<>\"\",Definitioner!B70,\"\")","v":"diethylether"}]
[70,{"$f":"IF(Definitioner!B71<>\"\",Definitioner!B71,\"\")","v":"acetone"}]
[71,{"$f":"IF(Definitioner!B72<>\"\",Definitioner!B72,\"\")","v":"isopropanol"}]
[72,{"$f":"IF(Definitioner!B73<>\"\",Definitioner!B73,\"\")","v":"1-propanol"}]
[73,{"$f":"IF(Definitioner!B74<>\"\",Definitioner!B74,\"\")","v":"diisopropylether"}]
[74,{"$f":"IF(Definitioner!B75<>\"\",Definitioner!B75,\"\")","v":"MEK"}]
[75,{"$f":"IF(Definitioner!B76<>\"\",Definitioner!B76,\"\")","v":"ethylacetat"}]
[76,{"$f":"IF(Definitioner!B77<>\"\",Definitioner!B77,\"\")","v":"methylacrylat"}]
[77,{"$f":"IF(Definitioner!B78<>\"\",Definitioner!B78,\"\")","v":"isobutanol"}]
[78,{"$f":"IF(Definitioner!B79<>\"\",Definitioner!B79,\"\")","v":"isopropylacetat"}]
[79,{"$f":"IF(Definitioner!B80<>\"\",Definitioner!B80,\"\")","v":"1-butanol"}]
[80,{"$f":"IF(Definitioner!B81<>\"\",Definitioner!B81,\"\")","v":"methylmetacrylat"}]
[81,{"$f":"IF(Definitioner!B82<>\"\",Definitioner!B82,\"\")","v":"MIBK"}]
[82,{"$f":"IF(Definitioner!B83<>\"\",Definitioner!B83,\"\")","v":"isobutylacetat"}]
[83,{"$f":"IF(Definitioner!B84<>\"\",Definitioner!B84,\"\")","v":"butylacetat"}]
[84,{"$f":"IF(Definitioner!B85<>\"\",Definitioner!B85,\"\")","v":"Vinylacetat"}]
[85,{"$f":"IF(Definitioner!B86<>\"\",Definitioner!B86,\"\")","v":"Acetaldehyd"}]
[86,{"$f":"IF(Definitioner!B87<>\"\",Definitioner!B87,\"\")","v":"Sum af xylener"}]
[87,{"$f":"IF(Definitioner!B88<>\"\",Definitioner!B88,\"\")","v":"Svovl, total"}]
[88,{"$f":"IF(Definitioner!B89<>\"\",Definitioner!B89,\"\")","v":"Chloroform"}]
[89,{"$f":"IF(Definitioner!B90<>\"\",Definitioner!B90,\"\")","v":"1,1,1-trichlorethan"}]
[90,{"$f":"IF(Definitioner!B91<>\"\",Definitioner!B91,\"\")","v":"Cyanid, total"}]
[91,{"$f":"IF(Definitioner!B92<>\"\",Definitioner!B92,\"\")","v":"Pentachlorphenol"}]
[92,{"$f":"IF(Definitioner!B93<>\"\",Definitioner!B93,\"\")","v":"Barium"}]
[93,{"$f":"IF(Definitioner!B94<>\"\",Definitioner!B94,\"\")","v":"PCB(total)*5"}]
[94,{"$f":"IF(Definitioner!B95<>\"\",Definitioner!B95,\"\")","v":"Chlorparaffiner C10-C13"}]
[95,{"$f":"IF(Definitioner!B96<>\"\",Definitioner!B96,\"\")","v":"Chlorparaffiner C14-C17"}]
[96,{"$f":"IF(Definitioner!B97<>\"\",Definitioner!B97,\"\")","v":"Asbest"}]
[97,{"$f":"IF(Definitioner!B98<>\"\",Definitioner!B98,\"\")","v":"Aquatic Acute 1(H400)"}]
[98,{"$f":"IF(Definitioner!B99<>\"\",Definitioner!B99,\"\")","v":"Aquatic Chronic 1 (H410)"}]
[99,{"$f":"IF(Definitioner!B100<>\"\",Definitioner!B100,\"\")","v":"Tørstof"}]

{"sheet":"CFRS","index":22,"n_rows":20,"n_cols":10,"rows_kept":20,"cut":false,"hidden":true,"merged":[]}
["samplePartnerCode","FractionCode","FractionName","TestCode","TestName","ParameterCode","ParameterName","NumericalValue","StringValue","Unit"]
["862-2024-03666101","J01","RAW PRODUCT","VL142","Dry matter","F001F129","Dry matter (2)",82.035928143712596,"82","%/No unit"]
["862-2024-03666101","J01","RAW PRODUCT","VL04B","PAH 7 (sum)","CA001440","Sum of 7 PAHs",0.100216384269908,"0,10","mg/kg dw"]
["862-2024-03666101","J01","RAW PRODUCT","VL04C","Benzo(a)pyrene from VL305","7300A035","Benzo-(a)-pyrene",2.1014534058349101E-2,"0,021","mg/kg DM"]
["862-2024-03666101","J01","RAW PRODUCT","VL04I","Dibenz(a,h)anthracene from VL305","7300A366","Dibenzo-(ah)-anthracene",0,"< 0,01","mg/kg DM"]
["862-2024-03666101","J01","RAW PRODUCT","VL04J","Fluoranthene from VL305","7300A359","Fluoranthene",3.01411513467508E-2,"0,03","mg/kg DM"]
["862-2024-03666101","J01","RAW PRODUCT","VL04K","Indeno(1,2,3-cd)pyrene from VL305","7300A365","Indeno-(1,2,3-cd)-pyrene",1.40824826185156E-2,"0,014","mg/kg DM"]
["862-2024-03666101","J01","RAW PRODUCT","VL04N","Benzo[b+j+k]fluoranthene from VL305","GF00005X","benzo[b+j+k]fluoranthene",3.4978216246292701E-2,"0,035","mg/kg DM"]
["862-2024-03666101","J01","RAW PRODUCT","VL309","Total Hydrocarbones (THC)","MC000004","Sum of Benzene-C35",76.664408540965994,"77","mg/kg DM"]
["862-2024-03666101","J01","RAW PRODUCT","VL309","Total Hydrocarbones (THC)","MC000007","Benzene-C10",2.2494924167313202,"2,2","mg/kg DM"]
["862-2024-03666101","J01","RAW PRODUCT","VL309","Total Hydrocarbones (THC)","CA001572","C10-C15",0,"< 5","mg/kg DM"]
["862-2024-03666101","J01","RAW PRODUCT","VL309","Total Hydrocarbones (THC)","CA001573","C15-C20",20.026753192761898,"20","mg/kg DM"]
["862-2024-03666101","J01","RAW PRODUCT","VL309","Total Hydrocarbones (THC)","CA00159R","C20-C35",54.388162931472799,"54","mg/kg DM"]
["862-2024-03666101","J01","RAW PRODUCT","VL309","Total Hydrocarbones (THC)","CA0015CV","Sum (C10-C20)",20.026753192761898,"20","mg/kg DM"]
["862-2024-03666101","J01","RAW PRODUCT","VLBC5","Cadmium (Cd) Calculation","7003A016","Cadmium",0.143229927007299,"0,14","mg/kg DM"]
["862-2024-03666101","J01","RAW PRODUCT","VLBD0","Chromium (Cr) Calculation","7003A005","Chromium",11.263357664233601,"11","mg/kg DM"]
["862-2024-03666101","J01","RAW PRODUCT","VLBA2","Copper (Cu) Calculation","7001A010","Copper",7.4442992700729897,"7,4","mg/kg DM"]
["862-2024-03666101","J01","RAW PRODUCT","VLBD7","Nickel (Ni) Calculation","7003A007","Nickel",6.37159854014598,"6,4","mg/kg DM"]
["862-2024-03666101","J01","RAW PRODUCT","VLBD5","Lead (Pb) Calculation","7003A003","Lead",10.6770291970803,"11","mg/kg DM"]
["862-2024-03666101","J01","RAW PRODUCT","VLB6T","Zinc (Zn) Calculation","7001A013","Zinc",32.241970802919703,"32","mg/kg DM"]

{"sheet":"BYGHP14","index":23,"n_rows":102,"n_cols":4,"rows_kept":102,"cut":false,"hidden":true,"merged":[]}
["HP14"]
[null,null,"<",">="]
["Parameter ID","Parameter","Afskæringsværdi H400 og H410","Farligt affald"]
[0,{"$f":"IF(Definitioner!B2<>\"\",Definitioner!B2,\"\")","v":"Dybde"}]
[1,{"$f":"IF(Definitioner!B3<>\"\",Definitioner!B3,\"\")","v":"Arsen"},0.1]
[2,{"$f":"IF(Definitioner!B4<>\"\",Definitioner!B4,\"\")","v":"Bly "},0.1]
[3,{"$f":"IF(Definitioner!B5<>\"\",Definitioner!B5,\"\")","v":"Cadmium"},0.1]
[4,{"$f":"IF(Definitioner!B6<>\"\",Definitioner!B6,\"\")","v":"Chrom VI"},0.1]
[5,{"$f":"IF(Definitioner!B7<>\"\",Definitioner!B7,\"\")","v":"Chrom total"}]
[6,{"$f":"IF(Definitioner!B8<>\"\",Definitioner!B8,\"\")","v":"Kobber "},0.1]
[7,{"$f":"IF(Definitioner!B9<>\"\",Definitioner!B9,\"\")","v":"Kviksølv"},0.1]
[8,{"$f":"IF(Definitioner!B10<>\"\",Definitioner!B10,\"\")","v":"Nikkel"},0.1]
[9,{"$f":"IF(Definitioner!B11<>\"\",Definitioner!B11,\"\")","v":"Tin"}]
[10,{"$f":"IF(Definitioner!B12<>\"\",Definitioner!B12,\"\")","v":"Zink"},0.1]
[11,{"$f":"IF(Definitioner!B13<>\"\",Definitioner!B13,\"\")","v":"Sum C6-C35 (Reflab1)"}]
[12,{"$f":"IF(Definitioner!B14<>\"\",Definitioner!B14,\"\")","v":"C6-C10 (Reflab1)"}]
[13,{"$f":"IF(Definitioner!B15<>\"\",Definitioner!B15,\"\")","v":"C10-C25 (Reflab1 gl.)"}]
[14,{"$f":"IF(Definitioner!B16<>\"\",Definitioner!B16,\"\")","v":"C25-C35 (Reflab1 gl.)"}]
[15,{"$f":"IF(Definitioner!B17<>\"\",Definitioner!B17,\"\")","v":"BTEX, sum"}]
[16,{"$f":"IF(Definitioner!B18<>\"\",Definitioner!B18,\"\")","v":"Benzen"}]
[17,{"$f":"IF(Definitioner!B19<>\"\",Definitioner!B19,\"\")","v":"Naphtalen"}]
[18,{"$f":"IF(Definitioner!B20<>\"\",Definitioner!B20,\"\")","v":"Sum af 7 PAH'er"}]
[19,{"$f":"IF(Definitioner!B21<>\"\",Definitioner!B21,\"\")","v":"Benz(a)pyren"}]
[20,{"$f":"IF(Definitioner!B22<>\"\",Definitioner!B22,\"\")","v":"Dibenz(a,h)anthracen"}]
[21,{"$f":"IF(Definitioner!B23<>\"\",Definitioner!B23,\"\")","v":"Phenoler, sum"}]
[22,{"$f":"IF(Definitioner!B24<>\"\",Definitioner!B24,\"\")","v":"Cyanid, total"}]
[23,{"$f":"IF(Definitioner!B25<>\"\",Definitioner!B25,\"\")","v":"Cyanid, syreflygtig"}]
[24,{"$f":"IF(Definitioner!B26<>\"\",Definitioner!B26,\"\")","v":"Fluoranthen"}]
[25,{"$f":"IF(Definitioner!B27<>\"\",Definitioner!B27,\"\")","v":"Benz(b+j+k)fluoranthen"}]
[26,{"$f":"IF(Definitioner!B28<>\"\",Definitioner!B28,\"\")","v":"Indeno(1,2,3-cd)pyren"}]
[27,{"$f":"IF(Definitioner!B29<>\"\",Definitioner!B29,\"\")","v":"Chrom (bortset fra VI)"}]
[28,{"$f":"IF(Definitioner!B30<>\"\",Definitioner!B30,\"\")","v":"Sum C6-C40 (Reflab4)"}]
[29,{"$f":"IF(Definitioner!B31<>\"\",Definitioner!B31,\"\")","v":"C6-C10 (Reflab4)"}]
[30,{"$f":"IF(Definitioner!B32<>\"\",Definitioner!B32,\"\")","v":"C10-C20 (Reflab4)"}]
[31,{"$f":"IF(Definitioner!B33<>\"\",Definitioner!B33,\"\")","v":"C10-C15 (Reflab4)"}]
[32,{"$f":"IF(Definitioner!B34<>\"\",Definitioner!B34,\"\")","v":"C15-C20 (Reflab4)"}]
[33,{"$f":"IF(Definitioner!B35<>\"\",Definitioner!B35,\"\")","v":"C20-C40 (Reflab4)"}]
[34,{"$f":"IF(Definitioner!B36<>\"\",Definitioner!B36,\"\")","v":"Terpentin (C7-C12) (Reflab1)"}]
[35,{"$f":"IF(Definitioner!B37<>\"\",Definitioner!B37,\"\")","v":"Petroleum (C9-C16) (Reflab1)"}]
[36,{"$f":"IF(Definitioner!B38<>\"\",Definitioner!B38,\"\")","v":"Terpentin (C7-C12) (Reflab4)"}]
[37,{"$f":"IF(Definitioner!B39<>\"\",Definitioner!B39,\"\")","v":"Petroleum (C9-C16) (Reflab4)"}]
[39,{"$f":"IF(Definitioner!B40<>\"\",Definitioner!B40,\"\")","v":"Molybdæn"}]
[40,{"$f":"IF(Definitioner!B41<>\"\",Definitioner!B41,\"\")","v":"MTBE"}]
[41,{"$f":"IF(Definitioner!B42<>\"\",Definitioner!B42,\"\")","v":"Trichlorethylen"}]
[42,{"$f":"IF(Definitioner!B43<>\"\",Definitioner!B43,\"\")","v":"Tetrachlorethylen"}]
[43,{"$f":"IF(Definitioner!B44<>\"\",Definitioner!B44,\"\")","v":"Tetrachlormethan"}]
[44,{"$f":"IF(Definitioner!B45<>\"\",Definitioner!B45,\"\")","v":"Toluen"}]
[45,{"$f":"IF(Definitioner!B46<>\"\",Definitioner!B46,\"\")","v":"Ethylbenzen"}]
[46,{"$f":"IF(Definitioner!B47<>\"\",Definitioner!B47,\"\")","v":"o-Xylen"}]
[47,{"$f":"IF(Definitioner!B48<>\"\",Definitioner!B48,\"\")","v":"m+p-Xylen"}]
[48,{"$f":"IF(Definitioner!B49<>\"\",Definitioner!B49,\"\")","v":"C20-C35 (Reflab1)"}]
[49,{"$f":"IF(Definitioner!B50<>\"\",Definitioner!B50,\"\")","v":"C15-C20 (Reflab1)"}]
[50,{"$f":"IF(Definitioner!B51<>\"\",Definitioner!B51,\"\")","v":"C10-C15 (Reflab1)"}]
[51,{"$f":"IF(Definitioner!B52<>\"\",Definitioner!B52,\"\")","v":"Sum C10-C20 (Reflab4)"}]
[52,{"$f":"IF(Definitioner!B53<>\"\",Definitioner!B53,\"\")","v":"Sum C10-C20 (Reflab1)"}]
[53,{"$f":"IF(Definitioner!B54<>\"\",Definitioner!B54,\"\")","v":"Vinylchlorid"}]
[54,{"$f":"IF(Definitioner!B55<>\"\",Definitioner!B55,\"\")","v":"1,1-dichlorethylen"}]
[55,{"$f":"IF(Definitioner!B56<>\"\",Definitioner!B56,\"\")","v":"trans-1,2-dichlorethylen"}]
[56,{"$f":"IF(Definitioner!B57<>\"\",Definitioner!B57,\"\")","v":"1,1-dichlorethan"}]
[57,{"$f":"IF(Definitioner!B58<>\"\",Definitioner!B58,\"\")","v":"cis-1,2-dichlorethylen"}]
[58,{"$f":"IF(Definitioner!B59<>\"\",Definitioner!B59,\"\")","v":"Dichlormethan"}]
[59,{"$f":"IF(Definitioner!B60<>\"\",Definitioner!B60,\"\")","v":"1,1,2-trichlorethan"}]
[60,{"$f":"IF(Definitioner!B61<>\"\",Definitioner!B61,\"\")","v":"1,2-dichlorethan"}]
[61,{"$f":"IF(Definitioner!B62<>\"\",Definitioner!B62,\"\")","v":"1,2-dibromethan"}]
[62,{"$f":"IF(Definitioner!B63<>\"\",Definitioner!B63,\"\")","v":"Chlorbenzen"}]
[63,{"$f":"IF(Definitioner!B64<>\"\",Definitioner!B64,\"\")","v":"1,2-dichlorbenzen"}]
[64,{"$f":"IF(Definitioner!B65<>\"\",Definitioner!B65,\"\")","v":"1,4-dichlorbenzen"}]
[65,{"$f":"IF(Definitioner!B66<>\"\",Definitioner!B66,\"\")","v":"Chlorethan"}]
[66,{"$f":"IF(Definitioner!B67<>\"\",Definitioner!B67,\"\")","v":"TBA (tert-butyl-alkohol)"}]
[67,{"$f":"IF(Definitioner!B68<>\"\",Definitioner!B68,\"\")","v":"methanol"}]
[68,{"$f":"IF(Definitioner!B69<>\"\",Definitioner!B69,\"\")","v":"Ethanol"}]
[69,{"$f":"IF(Definitioner!B70<>\"\",Definitioner!B70,\"\")","v":"diethylether"}]
[70,{"$f":"IF(Definitioner!B71<>\"\",Definitioner!B71,\"\")","v":"acetone"}]
[71,{"$f":"IF(Definitioner!B72<>\"\",Definitioner!B72,\"\")","v":"isopropanol"}]
[72,{"$f":"IF(Definitioner!B73<>\"\",Definitioner!B73,\"\")","v":"1-propanol"}]
[73,{"$f":"IF(Definitioner!B74<>\"\",Definitioner!B74,\"\")","v":"diisopropylether"}]
[74,{"$f":"IF(Definitioner!B75<>\"\",Definitioner!B75,\"\")","v":"MEK"}]
[75,{"$f":"IF(Definitioner!B76<>\"\",Definitioner!B76,\"\")","v":"ethylacetat"}]
[76,{"$f":"IF(Definitioner!B77<>\"\",Definitioner!B77,\"\")","v":"methylacrylat"}]
[77,{"$f":"IF(Definitioner!B78<>\"\",Definitioner!B78,\"\")","v":"isobutanol"}]
[78,{"$f":"IF(Definitioner!B79<>\"\",Definitioner!B79,\"\")","v":"isopropylacetat"}]
[79,{"$f":"IF(Definitioner!B80<>\"\",Definitioner!B80,\"\")","v":"1-butanol"}]
[80,{"$f":"IF(Definitioner!B81<>\"\",Definitioner!B81,\"\")","v":"methylmetacrylat"}]
[81,{"$f":"IF(Definitioner!B82<>\"\",Definitioner!B82,\"\")","v":"MIBK"}]
[82,{"$f":"IF(Definitioner!B83<>\"\",Definitioner!B83,\"\")","v":"isobutylacetat"}]
[83,{"$f":"IF(Definitioner!B84<>\"\",Definitioner!B84,\"\")","v":"butylacetat"}]
[84,{"$f":"IF(Definitioner!B85<>\"\",Definitioner!B85,\"\")","v":"Vinylacetat"}]
[85,{"$f":"IF(Definitioner!B86<>\"\",Definitioner!B86,\"\")","v":"Acetaldehyd"}]
[86,{"$f":"IF(Definitioner!B87<>\"\",Definitioner!B87,\"\")","v":"Sum af xylener"}]
[87,{"$f":"IF(Definitioner!B88<>\"\",Definitioner!B88,\"\")","v":"Svovl, total"}]
[88,{"$f":"IF(Definitioner!B89<>\"\",Definitioner!B89,\"\")","v":"Chloroform"}]
[89,{"$f":"IF(Definitioner!B90<>\"\",Definitioner!B90,\"\")","v":"1,1,1-trichlorethan"}]
[90,{"$f":"IF(Definitioner!B91<>\"\",Definitioner!B91,\"\")","v":"Cyanid, total"},0.1]
[91,{"$f":"IF(Definitioner!B92<>\"\",Definitioner!B92,\"\")","v":"Pentachlorphenol"}]
[92,{"$f":"IF(Definitioner!B93<>\"\",Definitioner!B93,\"\")","v":"Barium"}]
[93,{"$f":"IF(Definitioner!B94<>\"\",Definitioner!B94,\"\")","v":"PCB(total)*5"}]
[94,{"$f":"IF(Definitioner!B95<>\"\",Definitioner!B95,\"\")","v":"Chlorparaffiner C10-C13"},0.1]
[95,{"$f":"IF(Definitioner!B96<>\"\",Definitioner!B96,\"\")","v":"Chlorparaffiner C14-C17"},0.1]
[96,{"$f":"IF(Definitioner!B97<>\"\",Definitioner!B97,\"\")","v":"Asbest"}]
[97,{"$f":"IF(Definitioner!B98<>\"\",Definitioner!B98,\"\")","v":"Aquatic Acute 1(H400)"},null,25]
[98,{"$f":"IF(Definitioner!B99<>\"\",Definitioner!B99,\"\")","v":"Aquatic Chronic 1 (H410)"},null,0.25]
[99,{"$f":"IF(Definitioner!B100<>\"\",Definitioner!B100,\"\")","v":"Tørstof"}]

{"sheet":"BYG3","index":24,"n_rows":117,"n_cols":5,"rows_kept":117,"cut":false,"hidden":true,"merged":[]}
["Bygningsmaterialer, Sjællandsnetværket"]
[null,null,"<","<=",">"]
["Parameter ID","Parameter","Rent (Kat.1)","Forurenet (Kat.2)","Farligt affald (3)"]
[0,{"$f":"IF(Definitioner!B2<>\"\",Definitioner!B2,\"\")","v":"Dybde"}]
[1,{"$f":"IF(Definitioner!B3<>\"\",Definitioner!B3,\"\")","v":"Arsen"},20,1000,1000]
[2,{"$f":"IF(Definitioner!B4<>\"\",Definitioner!B4,\"\")","v":"Bly "},40,2500,2500]
[3,{"$f":"IF(Definitioner!B5<>\"\",Definitioner!B5,\"\")","v":"Cadmium"},"0,50",1000,1000]
[4,{"$f":"IF(Definitioner!B6<>\"\",Definitioner!B6,\"\")","v":"Chrom VI"},20,1000,1000]
[5,{"$f":"IF(Definitioner!B7<>\"\",Definitioner!B7,\"\")","v":"Chrom total"},500,1000,1000]
[6,{"$f":"IF(Definitioner!B8<>\"\",Definitioner!B8,\"\")","v":"Kobber "},500,2500,2500]
[7,{"$f":"IF(Definitioner!B9<>\"\",Definitioner!B9,\"\")","v":"Kviksølv"},"1,0",2500,2500]
[8,{"$f":"IF(Definitioner!B10<>\"\",Definitioner!B10,\"\")","v":"Nikkel"},30,1000,1000]
[9,{"$f":"IF(Definitioner!B11<>\"\",Definitioner!B11,\"\")","v":"Tin"}]
[10,{"$f":"IF(Definitioner!B12<>\"\",Definitioner!B12,\"\")","v":"Zink"},500,2500,2500]
[11,{"$f":"IF(Definitioner!B13<>\"\",Definitioner!B13,\"\")","v":"Sum C6-C35 (Reflab1)"}]
[12,{"$f":"IF(Definitioner!B14<>\"\",Definitioner!B14,\"\")","v":"C6-C10 (Reflab1)"}]
[13,{"$f":"IF(Definitioner!B15<>\"\",Definitioner!B15,\"\")","v":"C10-C25 (Reflab1 gl.)"}]
[14,{"$f":"IF(Definitioner!B16<>\"\",Definitioner!B16,\"\")","v":"C25-C35 (Reflab1 gl.)"}]
[15,{"$f":"IF(Definitioner!B17<>\"\",Definitioner!B17,\"\")","v":"BTEX, sum"}]
[16,{"$f":"IF(Definitioner!B18<>\"\",Definitioner!B18,\"\")","v":"Benzen"}]
[17,{"$f":"IF(Definitioner!B19<>\"\",Definitioner!B19,\"\")","v":"Naphtalen"}]
[18,{"$f":"IF(Definitioner!B20<>\"\",Definitioner!B20,\"\")","v":"Sum af 7 PAH'er"},"4,0","Ingen grænse","Ingen grænse"]
[19,{"$f":"IF(Definitioner!B21<>\"\",Definitioner!B21,\"\")","v":"Benz(a)pyren"},"0,30",1000,1000]
[20,{"$f":"IF(Definitioner!B22<>\"\",Definitioner!B22,\"\")","v":"Dibenz(a,h)anthracen"},"0,30",1000,1000]
[21,{"$f":"IF(Definitioner!B23<>\"\",Definitioner!B23,\"\")","v":"Phenoler, sum"}]
[22,{"$f":"IF(Definitioner!B24<>\"\",Definitioner!B24,\"\")","v":"Cyanid, total"},"1,0","Ingen grænse","Ingen grænse"]
[23,{"$f":"IF(Definitioner!B25<>\"\",Definitioner!B25,\"\")","v":"Cyanid, syreflygtig"}]
[24,{"$f":"IF(Definitioner!B26<>\"\",Definitioner!B26,\"\")","v":"Fluoranthen"}]
[25,{"$f":"IF(Definitioner!B27<>\"\",Definitioner!B27,\"\")","v":"Benz(b+j+k)fluoranthen"},1000,1000,1000]
[26,{"$f":"IF(Definitioner!B28<>\"\",Definitioner!B28,\"\")","v":"Indeno(1,2,3-cd)pyren"}]
[27,{"$f":"IF(Definitioner!B29<>\"\",Definitioner!B29,\"\")","v":"Chrom (bortset fra VI)"}]
[28,{"$f":"IF(Definitioner!B30<>\"\",Definitioner!B30,\"\")","v":"Sum C6-C40 (Reflab4)"}]
[29,{"$f":"IF(Definitioner!B31<>\"\",Definitioner!B31,\"\")","v":"C6-C10 (Reflab4)"}]
[30,{"$f":"IF(Definitioner!B32<>\"\",Definitioner!B32,\"\")","v":"C10-C20 (Reflab4)"}]
[31,{"$f":"IF(Definitioner!B33<>\"\",Definitioner!B33,\"\")","v":"C10-C15 (Reflab4)"}]
[32,{"$f":"IF(Definitioner!B34<>\"\",Definitioner!B34,\"\")","v":"C15-C20 (Reflab4)"}]
[33,{"$f":"IF(Definitioner!B35<>\"\",Definitioner!B35,\"\")","v":"C20-C40 (Reflab4)"}]
[34,{"$f":"IF(Definitioner!B36<>\"\",Definitioner!B36,\"\")","v":"Terpentin (C7-C12) (Reflab1)"}]
[35,{"$f":"IF(Definitioner!B37<>\"\",Definitioner!B37,\"\")","v":"Petroleum (C9-C16) (Reflab1)"}]
[36,{"$f":"IF(Definitioner!B38<>\"\",Definitioner!B38,\"\")","v":"Terpentin (C7-C12) (Reflab4)"}]
[37,{"$f":"IF(Definitioner!B39<>\"\",Definitioner!B39,\"\")","v":"Petroleum (C9-C16) (Reflab4)"}]
[39,{"$f":"IF(Definitioner!B40<>\"\",Definitioner!B40,\"\")","v":"Molybdæn"}]
[40,{"$f":"IF(Definitioner!B41<>\"\",Definitioner!B41,\"\")","v":"MTBE"}]
[41,{"$f":"IF(Definitioner!B42<>\"\",Definitioner!B42,\"\")","v":"Trichlorethylen"}]
[42,{"$f":"IF(Definitioner!B43<>\"\",Definitioner!B43,\"\")","v":"Tetrachlorethylen"}]
[43,{"$f":"IF(Definitioner!B44<>\"\",Definitioner!B44,\"\")","v":"Tetrachlormethan"}]
[44,{"$f":"IF(Definitioner!B45<>\"\",Definitioner!B45,\"\")","v":"Toluen"}]
[45,{"$f":"IF(Definitioner!B46<>\"\",Definitioner!B46,\"\")","v":"Ethylbenzen"}]
[46,{"$f":"IF(Definitioner!B47<>\"\",Definitioner!B47,\"\")","v":"o-Xylen"}]
[47,{"$f":"IF(Definitioner!B48<>\"\",Definitioner!B48,\"\")","v":"m+p-Xylen"}]
[48,{"$f":"IF(Definitioner!B49<>\"\",Definitioner!B49,\"\")","v":"C20-C35 (Reflab1)"}]
[49,{"$f":"IF(Definitioner!B50<>\"\",Definitioner!B50,\"\")","v":"C15-C20 (Reflab1)"}]
[50,{"$f":"IF(Definitioner!B51<>\"\",Definitioner!B51,\"\")","v":"C10-C15 (Reflab1)"}]
[51,{"$f":"IF(Definitioner!B52<>\"\",Definitioner!B52,\"\")","v":"Sum C10-C20 (Reflab4)"}]
[52,{"$f":"IF(Definitioner!B53<>\"\",Definitioner!B53,\"\")","v":"Sum C10-C20 (Reflab1)"}]
[53,{"$f":"IF(Definitioner!B54<>\"\",Definitioner!B54,\"\")","v":"Vinylchlorid"}]
[54,{"$f":"IF(Definitioner!B55<>\"\",Definitioner!B55,\"\")","v":"1,1-dichlorethylen"}]
[55,{"$f":"IF(Definitioner!B56<>\"\",Definitioner!B56,\"\")","v":"trans-1,2-dichlorethylen"}]
[56,{"$f":"IF(Definitioner!B57<>\"\",Definitioner!B57,\"\")","v":"1,1-dichlorethan"}]
[57,{"$f":"IF(Definitioner!B58<>\"\",Definitioner!B58,\"\")","v":"cis-1,2-dichlorethylen"}]
[58,{"$f":"IF(Definitioner!B59<>\"\",Definitioner!B59,\"\")","v":"Dichlormethan"}]
[59,{"$f":"IF(Definitioner!B60<>\"\",Definitioner!B60,\"\")","v":"1,1,2-trichlorethan"}]
[60,{"$f":"IF(Definitioner!B61<>\"\",Definitioner!B61,\"\")","v":"1,2-dichlorethan"}]
[61,{"$f":"IF(Definitioner!B62<>\"\",Definitioner!B62,\"\")","v":"1,2-dibromethan"}]
[62,{"$f":"IF(Definitioner!B63<>\"\",Definitioner!B63,\"\")","v":"Chlorbenzen"}]
[63,{"$f":"IF(Definitioner!B64<>\"\",Definitioner!B64,\"\")","v":"1,2-dichlorbenzen"}]
[64,{"$f":"IF(Definitioner!B65<>\"\",Definitioner!B65,\"\")","v":"1,4-dichlorbenzen"}]
[65,{"$f":"IF(Definitioner!B66<>\"\",Definitioner!B66,\"\")","v":"Chlorethan"}]
[66,{"$f":"IF(Definitioner!B67<>\"\",Definitioner!B67,\"\")","v":"TBA (tert-butyl-alkohol)"}]
[67,{"$f":"IF(Definitioner!B68<>\"\",Definitioner!B68,\"\")","v":"methanol"}]
[68,{"$f":"IF(Definitioner!B69<>\"\",Definitioner!B69,\"\")","v":"Ethanol"}]
[69,{"$f":"IF(Definitioner!B70<>\"\",Definitioner!B70,\"\")","v":"diethylether"}]
[70,{"$f":"IF(Definitioner!B71<>\"\",Definitioner!B71,\"\")","v":"acetone"}]
[71,{"$f":"IF(Definitioner!B72<>\"\",Definitioner!B72,\"\")","v":"isopropanol"}]
[72,{"$f":"IF(Definitioner!B73<>\"\",Definitioner!B73,\"\")","v":"1-propanol"}]
[73,{"$f":"IF(Definitioner!B74<>\"\",Definitioner!B74,\"\")","v":"diisopropylether"}]
[74,{"$f":"IF(Definitioner!B75<>\"\",Definitioner!B75,\"\")","v":"MEK"}]
[75,{"$f":"IF(Definitioner!B76<>\"\",Definitioner!B76,\"\")","v":"ethylacetat"}]
[76,{"$f":"IF(Definitioner!B77<>\"\",Definitioner!B77,\"\")","v":"methylacrylat"}]
[77,{"$f":"IF(Definitioner!B78<>\"\",Definitioner!B78,\"\")","v":"isobutanol"}]
[78,{"$f":"IF(Definitioner!B79<>\"\",Definitioner!B79,\"\")","v":"isopropylacetat"}]
[79,{"$f":"IF(Definitioner!B80<>\"\",Definitioner!B80,\"\")","v":"1-butanol"}]
[80,{"$f":"IF(Definitioner!B81<>\"\",Definitioner!B81,\"\")","v":"methylmetacrylat"}]
[81,{"$f":"IF(Definitioner!B82<>\"\",Definitioner!B82,\"\")","v":"MIBK"}]
[82,{"$f":"IF(Definitioner!B83<>\"\",Definitioner!B83,\"\")","v":"isobutylacetat"}]
[83,{"$f":"IF(Definitioner!B84<>\"\",Definitioner!B84,\"\")","v":"butylacetat"}]
[84,{"$f":"IF(Definitioner!B85<>\"\",Definitioner!B85,\"\")","v":"Vinylacetat"}]
[85,{"$f":"IF(Definitioner!B86<>\"\",Definitioner!B86,\"\")","v":"Acetaldehyd"}]
[86,{"$f":"IF(Definitioner!B87<>\"\",Definitioner!B87,\"\")","v":"Sum af xylener"}]
[87,{"$f":"IF(Definitioner!B88<>\"\",Definitioner!B88,\"\")","v":"Svovl, total"}]
[88,{"$f":"IF(Definitioner!B89<>\"\",Definitioner!B89,\"\")","v":"Chloroform"}]
[89,{"$f":"IF(Definitioner!B90<>\"\",Definitioner!B90,\"\")","v":"1,1,1-trichlorethan"}]
[90,{"$f":"IF(Definitioner!B91<>\"\",Definitioner!B91,\"\")","v":"Cyanid, total"}]
[91,{"$f":"IF(Definitioner!B92<>\"\",Definitioner!B92,\"\")","v":"Pentachlorphenol"}]
[92,{"$f":"IF(Definitioner!B93<>\"\",Definitioner!B93,\"\")","v":"Barium"}]
[93,{"$f":"IF(Definitioner!B94<>\"\",Definitioner!B94,\"\")","v":"PCB(total)*5"},"0,10",50,50]
[94,{"$f":"IF(Definitioner!B95<>\"\",Definitioner!B95,\"\")","v":"Chlorparaffiner C10-C13"},2500,2500,2500]
[95,{"$f":"IF(Definitioner!B96<>\"\",Definitioner!B96,\"\")","v":"Chlorparaffiner C14-C17"},2500,2500,2500]
[96,{"$f":"IF(Definitioner!B97<>\"\",Definitioner!B97,\"\")","v":"Asbest"},"Ikke påvist",null,"påvist"]
[97,{"$f":"IF(Definitioner!B98<>\"\",Definitioner!B98,\"\")","v":"Aquatic Acute 1(H400)"}]
[98,{"$f":"IF(Definitioner!B99<>\"\",Definitioner!B99,\"\")","v":"Aquatic Chronic 1 (H410)"}]
[99,{"$f":"IF(Definitioner!B100<>\"\",Definitioner!B100,\"\")","v":"Tørstof"}]
[100,{"$f":"IF(Definitioner!B101<>\"\",Definitioner!B101,\"\")","v":"Phenol"}]
[101,{"$f":"IF(Definitioner!B102<>\"\",Definitioner!B102,\"\")","v":"Cresol (sum)"}]
[102,{"$f":"IF(Definitioner!B103<>\"\",Definitioner!B103,\"\")","v":"Xylenols"}]
[103,{"$f":"IF(Definitioner!B104<>\"\",Definitioner!B104,\"\")","v":"2-Methylphenol"}]
[104,{"$f":"IF(Definitioner!B105<>\"\",Definitioner!B105,\"\")","v":"3-Methylphenol"}]
[105,{"$f":"IF(Definitioner!B106<>\"\",Definitioner!B106,\"\")","v":"4-Methylphenol"}]
[106,{"$f":"IF(Definitioner!B107<>\"\",Definitioner!B107,\"\")","v":"2,3-Dimethylphenol"}]
[107,{"$f":"IF(Definitioner!B108<>\"\",Definitioner!B108,\"\")","v":"2,4-Dimethylphenol"}]
[108,{"$f":"IF(Definitioner!B109<>\"\",Definitioner!B109,\"\")","v":"2,5-Dimethylphenol"}]
[109,{"$f":"IF(Definitioner!B110<>\"\",Definitioner!B110,\"\")","v":"2,6-Dimethylphenol"}]
[110,{"$f":"IF(Definitioner!B111<>\"\",Definitioner!B111,\"\")","v":"3,4-Dimethylphenol"}]
[111,{"$f":"IF(Definitioner!B112<>\"\",Definitioner!B112,\"\")","v":"3,5-Dimethylphenol"}]
[112,{"$f":"IF(Definitioner!B113<>\"\",Definitioner!B113,\"\")","v":"Kobolt(Co)"}]
[113,{"$f":"IF(Definitioner!B114<>\"\",Definitioner!B114,\"\")","v":"Mangan(Mn)"}]
[114,{"$f":"IF(Definitioner!B115<>\"\",Definitioner!B115,\"\")","v":"Vanadium(V)"}]

{"sheet":"Vejledning","index":25,"n_rows":31,"n_cols":1,"rows_kept":31,"cut":false,"hidden":false,"merged":[]}
["Vejledning i hvorledes du anvender vores klassificeringsark med de ekstra muligheder du har for at tilrette den efter dit behov."]
[]
["Hvis du vil ændre noget i regearket skal du trykke på denne for at få lov til det:"]
[]
[]
[]
[]
["Du kan se alle dine resultater enten vandret eller lodret"]
[]
[]
[]
["Udskrivning af arket:  tryk på denne knap"]
[]
[]
["Hvis du vil have gemt arket uden macroer skal du trykke på denne knap"]
[]
[]
[]
["Hvis du trykker på denne knap vil du få sorteret alle dine prøver efter kategori på hvert sit faneblad"]
[]
[]
["Du vil få ekstra faneblade"]
[]
[]
["Ændring af klassificeringsmetode:"]
["Du kan i dette felt ændre hvilken metode du vil have dine jordprøver klassificeret efter"]
[]
[]
[]
[]
["Du kan vælge andre farver i klassificering end det forvalgte (3 muligheder)"]

{"sheet":"Log","index":26,"n_rows":12,"n_cols":2,"rows_kept":12,"cut":false,"hidden":true,"merged":[]}
["04-07-2024 10:46:13 Indtastet: AR-24-VL-01036661-01"]
["04-07-2024 10:46:14 Start GetDataFromELIMSB "]
[]
[null,"04-07-2024 10:46:14 VBM-sag kopierer VBM logo "]
[null,"04-07-2024 10:46:14 VBM-sag færdig med at kopiere VBM logo "]
["04-07-2024 10:46:14 Åbner connection til DBnr= 6"]
["04-07-2024 10:46:14 Connection til DBnr= 6"]
[]
["04-07-2024 10:46:14 beGSD2_SP: 862-2024-03666101"]
["04-07-2024 10:46:14 beGSTsort_SP  862-2024-03666101"]
["04-07-2024 10:46:15 beGTestParam_SP: VL04B|CA001440"]
["04-07-2024 10:46:15 beGR_SP: 862-2024-03666101 : "]